program: Gaussian 09
title: 000024286
version: EM64L-G09RevD.01
frameworkgroup: C1[X(C9H9NO)]
method: RPBEPBE
basis: SDD
operation: Freq
keyword: #pfreq=noraman
keyword: PBEPBE/SDD
title: #p freq=noraman PBEPBE/SDD
converged: NO NO NO NO
title: Mulliken charges:
elementType: O N C C C C C C C C C H H H H H H H H H
charge: -0.245137 -0.141999 -0.395244 -0.420651 0.087408 0.267874 -0.328136 -0.346843 -0.233751 -0.222052 -0.225610 0.259887 0.243413 0.241076 0.246165 0.247850 0.272996 0.229275 0.231882 0.231595
chargesum: 0.00000
title: Mulliken charges with hydrogens summed into heavy atoms:
elementType: O N C C C C C C C C C
charge: -0.245137 -0.141999 0.108057 0.066590 0.087408 0.267874 -0.080285 -0.073847 -0.004476 0.009830 0.005985
polarizability: 1.46697835e+02 5.73341607e-01 1.09965453e+02 -6.28210212e+00 5.19640987e+00 5.36981254e+01
1716.lowfreq: -5.3671 -0.0008 -0.0008 0.0004 12.1926 14.8577 53.6077 86.2812 142.1006
frequency: 53.5995 86.2686 142.0970 150.1065 207.4512 262.5058 356.3929 404.2528 427.2979 460.1040 605.5121 615.3667 685.2982 686.8690 704.1829 795.4921 803.2136 857.2541 861.0544 917.8468 946.8520 989.2033 990.6493 1001.5893 1006.4399 1016.8788 1043.1927 1081.9431 1098.6555 1110.6761 1120.4473 1140.6871 1172.9264 1182.2278 1223.1633 1314.1431 1371.0236 1386.9176 1435.5487 1464.0225 1478.1062 1482.4036 1556.7718 1596.0439 1610.2818 3071.2942 3082.7329 3126.7221 3138.0186 3151.1370 3160.9658 3169.4408 3173.2675 3191.2822
redmass: 4.0972 3.1957 3.3435 4.5560 3.9839 4.2058 5.9227 2.8188 4.7284 4.4574 6.1875 6.4748 4.8233 6.3988 1.5114 1.8815 1.1738 4.2712 1.2658 4.8934 1.4709 2.1541 2.3657 1.1412 1.3310 3.0378 2.1143 1.5551 1.2731 1.3506 1.5802 1.4379 1.0595 1.1285 3.5807 1.3234 5.1106 9.4541 2.2586 1.0763 2.0878 1.3005 9.2432 6.8973 6.0628 1.0499 1.0582 1.0851 1.0886 1.0929 1.0957 1.1008 1.1188 1.1176
irintensity: 2.4861 3.1304 1.6817 4.7133 6.1851 9.9879 1.1434 0.0463 3.6386 6.3094 7.1507 1.8576 6.3184 5.8602 91.4536 24.1721 16.4880 9.2143 0.4146 3.3748 4.6900 1.1843 0.3830 3.0572 0.7739 46.9805 36.1515 11.3600 1.8774 10.1262 17.6083 3.3198 0.7956 19.1311 56.3708 1.0544 378.7411 4.7413 12.5296 4.4500 19.5671 10.5382 175.5175 30.1359 9.3341 20.9158 31.6546 0.0160 9.8773 17.1309 20.7894 15.9913 3.0488 22.5133
temp: 298.150 k
press: 1.00000 atm
elementType: 8 7 6 6 6 6 6 6 6 6 6 1 1 1 1 1 1 1 1 1
symmnumber: 1
zpe: 413715.4 jmol-1
zpe.correction: 0.157576 hartree
zpe.thermalcorrener: 0.166996 hartree
zpe.thermalcorrenthalpy: 0.167940 hartree
zpe.thermalcorrgfe: 0.122242 hartree
zpe.sumelectzpe: -477.501223 hartree
zpe.sumelectthermal: -477.491803 hartree
zpe.sumelectthermalent: -477.490859 hartree
zpe.sumelectthermalfe: -477.536557 hartree
dipole: -0.3325 -3.4292 1.6681
dipole: 3.8279
quadrupole: -51.5876 -64.6153 -66.7543
quadrupole: -5.7471 1.5719 2.6356
quadrupole: 9.3981 -3.6296 -5.7685 -5.7471 1.5719 2.6356
hfenergy: -477.6587989 hartree
pointgroup: C01 [X(C9H9N1O1)]
dipole: -0.0328933 1.0522702 -1.0768922 debye
dipolederiv: -0.7318927 0.1579681 -0.0841427 -0.0874959 -0.892406 0.3004384 0.0256552 0.2545466 -0.4609639 -1.234729 -0.4459223 0.3670147 -0.8182064 -0.7529424 0.1008531 0.2089761 -0.0995282 -0.3032876 0.2519597 0.0542421 -0.0035465 0.1033563 0.1530985 0.1113886 -0.0315479 0.1112041 0.1536679 0.1845714 0.1089325 -0.1459921 0.2183987 0.3198657 0.0209521 -0.1894186 0.0408076 0.1818573 1.8432284 0.1609659 0.0547687 0.526318 1.1815931 -0.4515076 0.0997626 -0.2803012 0.2962552 -0.4950699 0.0754983 -0.0852534 0.086 -0.0634299 0.0652635 -0.0783189 0.0409582 -0.0336405 0.0300007 0.068908 0.046114 -0.0679475 -0.0130117 -0.0202952 0.1012975 0.001915 -0.1005904 0.0171167 -0.0996401 0.05135 0.0814546 0.0339151 -0.0096586 -0.0098314 -0.0545626 -0.1081869 -0.1777582 -0.0717168 0.0116695 -0.1095028 0.1161466 -0.0496361 0.0032102 -0.0469903 -0.1523646 -0.0162185 0.1678843 0.0225487 0.1801705 0.0014681 0.0196518 0.0080893 0.0198951 -0.1537429 0.0916381 -0.029395 0.0686803 -0.0138572 0.0049957 -0.0198584 0.0587097 -0.0232028 -0.1242239 0.004679 -0.0056573 -0.0140002 0.0894332 -0.0341118 -0.0749774 0.0459615 -0.0296562 0.0903258 -0.0718597 -0.0354512 -0.0705912 -0.0186353 0.0608802 -0.0559985 -0.1199666 -0.0566077 0.0483368 0.1265245 0.016788 -0.0067858 -0.0652389 -0.121632 0.0501597 0.0226994 0.016518 0.0381143 0.0816271 -0.0603831 -0.0502468 -0.0233458 0.0285932 -0.0575449 0.0094886 0.0110745 -0.0937777 0.0401755 -0.1042805 -0.0236086 -0.1024679 0.0169175 -0.0011521 -0.0280339 0.0037074 0.1329592 0.1270328 0.0532995 -0.0182572 0.018393 -0.0030268 0.0179341 0.0053596 0.0368983 0.1500815 0.0612929 0.04433 -0.0253078 0.0694969 -0.1019365 0.0405526 -0.0347242 0.0371861 0.1469818 -0.0277241 -0.0995567 -0.0281982 -0.1129177 -0.0186192 -0.0053856 -0.0299951 -0.0044362 0.1523527 -0.1045948 0.0431865 -0.0662152 0.0465943 0.0836428 0.0188205 -0.0673732 0.0205744 0.139846 unknown
polarizability: 144.8500474|2.7888046|106.9532173|14.1508983|-13.4926341|58.5581488 unknown
InChI: InChI=1S/C9H9NO/c11-9(10-6-7-10)8-4-2-1-3-5-8/h1-5H,6-7H2
charge 0 multiplicity 1
20 atoms
O  1.310622 -1.742027 1.195459
N  2.008052 0.398652 0.577805
C  3.428811 0.143878 0.271365
C  2.565198 1.008125 -0.661426
C  1.02578 -0.603988 0.7106
C  -0.369571 -0.211202 0.321862
C  -0.741188 1.136774 0.075186
C  -1.344513 -1.237436 0.215538
C  -2.069808 1.449996 -0.283371
C  -2.670315 -0.922174 -0.146537
C  -3.035648 0.42212 -0.399289
H  3.691778 -0.871117 -0.049747
H  4.157035 0.626731 0.930906
H  2.686727 2.096897 -0.655087
H  2.26311 0.575902 -1.623503
H  0.001595 1.93234 0.192121
H  -1.03757 -2.266835 0.428565
H  -2.35536 2.49226 -0.464154
H  -3.418375 -1.718312 -0.229523
H  -4.066861 0.667815 -0.677371
