program: Gaussian 09
title: 000263585
version: EM64L-G09RevD.01
frameworkgroup: C1[X(C13H10Cl2N2)]
method: RPBEPBE
basis: SDD
operation: Freq
keyword: #p
keyword: freq=noraman
keyword: PBEPBE/SDD
title: #p freq=noraman PBEPBE/SDD
converged: NO YES NO NO
title: Mulliken charges:
elementType: Cl Cl N N C C C C C C C C C C C C C H H H H H H H H H H
charge: -0.071628 -0.077987 -0.680791 -0.707908 -0.696030 0.378025 0.324314 0.281689 0.161538 -0.590725 -0.655341 -0.514157 -0.360222 0.751167 0.551182 -0.344516 -0.455493 0.255678 0.255581 0.232676 0.262120 0.233109 0.216268 0.319739 0.320196 0.305848 0.305672
chargesum: 0.00000
title: Mulliken charges with hydrogens summed into heavy atoms:
elementType: Cl Cl N N C C C C C C C C C C C C C
charge: -0.071628 -0.077987 -0.040856 -0.096389 -0.184770 0.378025 0.324314 0.281689 0.161538 -0.590725 -0.422666 -0.252037 -0.127114 0.751167 0.551182 -0.344516 -0.239226
polarizability: 3.25269181e+02 -6.75533344e-01 1.91116679e+02 -2.74176174e-03 5.38911953e-03 6.94015685e+01
1716.lowfreq: -4.1409 -3.6095 -0.0009 0.0013 0.0019 3.8506 56.9879 82.5648 103.7522
frequency: 56.9876 82.5645 103.7522 114.7502 153.6244 178.0062 212.7392 259.4125 273.1430 283.5966 294.7381 310.4725 351.1719 353.7123 362.3281 383.8205 388.0007 428.8096 434.6371 450.5179 479.1894 497.6077 543.5955 553.9805 594.4074 605.2938 638.6928 691.5934 724.8459 736.8450 748.1438 767.8720 795.7525 814.4794 854.2884 869.7526 927.7218 936.4943 950.0861 977.1806 1020.0682 1034.9024 1069.1926 1118.4833 1136.4044 1158.8757 1171.9946 1212.4357 1238.7852 1276.1853 1320.8980 1340.4353 1371.0217 1384.9323 1428.0305 1459.8091 1466.5201 1476.5839 1498.3844 1562.5985 1593.0509 1604.7404 1638.4529 1642.6632 1645.4546 2989.9170 3033.7180 3116.7350 3118.3069 3142.1391 3164.8341 3549.7182 3569.1071 3696.5237 3709.6785
redmass: 5.7452 4.5181 8.5672 7.9968 5.0917 18.8646 2.8985 6.0947 3.8603 3.7782 7.0134 5.5671 1.2324 6.6782 1.0497 5.0026 4.6016 2.3843 1.3211 1.0295 4.0907 5.0565 7.2071 3.1481 4.1583 5.5369 3.8440 6.8353 4.7880 5.9781 3.6667 5.9705 7.0186 1.4983 1.5441 1.5217 2.9831 1.4552 2.1285 2.8974 4.2744 1.7342 1.7410 2.3324 1.1342 1.4539 2.5827 1.5408 1.7636 1.6556 2.1236 6.7606 5.7265 4.4835 1.1395 5.3246 4.8654 5.2501 4.3600 6.7473 6.2411 1.5223 1.9197 3.5805 2.2589 1.0610 1.0992 1.0892 1.0893 1.0968 1.0927 1.0443 1.0448 1.1047 1.1040
irintensity: 2.5911 0.0049 0.3325 1.1535 0.0608 1.3042 5.1557 1.5129 18.2978 0.0655 0.6239 5.0249 284.7695 3.9740 5.6425 34.7000 2.2442 42.8382 230.5510 13.4325 1.4962 2.1482 29.0955 0.7214 0.8373 9.7922 6.3391 28.4408 0.9476 23.2822 5.0135 3.3989 22.9366 49.7802 31.9016 10.0665 4.2743 2.2641 12.3763 19.3150 47.8636 17.5763 47.2316 2.2493 0.1840 3.7818 38.4955 1.5002 16.1394 19.6271 44.5902 58.0702 41.0522 11.4203 5.8137 22.6697 89.1188 277.1766 39.4594 50.6187 25.7545 147.2311 2.5459 85.8909 465.4523 10.4676 5.7807 8.5861 38.1795 24.1201 1.9370 147.5488 108.0717 46.1794 19.9844
temp: 298.150 k
press: 1.00000 atm
elementType: 17 17 7 7 6 6 6 6 6 6 6 6 6 6 6 6 6 1 1 1 1 1 1 1 1 1 1
symmnumber: 1
zpe: 521250.0 jmol-1
zpe.correction: 0.198534 hartree
zpe.thermalcorrener: 0.213471 hartree
zpe.thermalcorrenthalpy: 0.214415 hartree
zpe.thermalcorrgfe: 0.156919 hartree
zpe.sumelectzpe: -1529.862203 hartree
zpe.sumelectthermal: -1529.847266 hartree
zpe.sumelectthermalent: -1529.846322 hartree
zpe.sumelectthermalfe: -1529.903818 hartree
dipole: 2.9687 0.9407 -0.0560
dipole: 3.1147
quadrupole: -74.7777 -107.0775 -119.1681
quadrupole: -2.2549 -0.1866 -0.0166
quadrupole: 25.5634 -6.7364 -18.8270 -2.2549 -0.1866 -0.0166
hfenergy: -1530.0607369 hartree
pointgroup: C01 [X(C13H10Cl2N2)]
dipole: -1.1576622 -0.401189 -0.0217122 debye
polarizability: 325.2093655|2.9109456|191.1764671|-0.0828791|0.0104359|69.4015961 unknown
InChI: InChI=1S/C13H10Cl2N2/c14-11-5-9-8-2-1-7(16)3-6(8)4-10(9)12(15)13(11)17/h1-3,5H,4,16-17H2
charge 0 multiplicity 1
27 atoms
Cl 2.647645 -2.898718 -0.001933
Cl 3.895682 2.544977 -0.001513
N  4.465397 -0.442277 0.001863
N  -5.31765 -0.235428 0.004734
C  -0.466598 -1.7688 0.000538
C  0.741332 -0.844628 0.000296
C  -1.638254 -0.790407 0.001068
C  0.317913 0.522853 0.000852
C  -1.15244 0.553411 0.001156
C  2.101319 -1.142861 -0.000131
C  -3.010427 -1.068604 0.001125
C  1.276466 1.559728 0.00059
C  -2.07115 1.625823 0.001189
C  3.115443 -0.135225 -0.000207
C  -3.942455 0.014574 0.001747
C  2.635448 1.208526 0.000089
C  -3.454566 1.356915 0.001392
H  -0.471711 -2.432068 0.887136
H  -0.472355 -2.432197 -0.885923
H  -3.376097 -2.103075 0.001115
H  0.985035 2.613463 0.000634
H  -1.723444 2.665264 0.001018
H  -4.172032 2.186691 0.001501
H  4.763309 -1.413895 -0.003569
H  5.153155 0.30616 -0.002984
H  -5.674935 -1.18571 -0.005923
H  -5.985431 0.529309 -0.00586
