program: Gaussian 09
title: 000263574
version: EM64L-G09RevD.01
frameworkgroup: C1[X(C13H8O3)]
method: RPBEPBE
basis: SDD
operation: Freq
keyword: #pfreq=noraman
keyword: PBEPBE/SDD
title: #p freq=noraman PBEPBE/SDD
converged: NO NO NO NO
title: Mulliken charges:
elementType: O O O C C C C C C C C C C C C C H H H H H H H H
charge: -0.247952 -0.432610 -0.202638 0.314777 0.306843 0.076139 0.137735 -0.495905 -0.360563 0.061019 -0.351549 -0.324316 0.277385 -0.234163 -0.382702 -0.232505 0.249097 0.233049 0.277457 0.266382 0.230117 0.235287 0.240069 0.359546
chargesum: 0.00000
title: Mulliken charges with hydrogens summed into heavy atoms:
elementType: O O O C C C C C C C C C C C C C
charge: -0.247952 -0.073063 -0.202638 0.314777 0.306843 0.076139 0.137735 -0.246808 -0.127515 0.061019 -0.074091 -0.057934 0.277385 0.001124 -0.152585 0.007563
polarizability: 2.43091667e+02 6.72760364e+00 1.69022474e+02 -6.24898117e-03 -3.37429577e-04 5.66151831e+01
1716.lowfreq: -1.2134 0.0007 0.0008 0.0009 6.5055 13.4637 64.9880 88.9164 142.8279
frequency: 64.9806 88.9082 142.8255 178.8173 188.1202 248.1159 304.1298 333.3717 354.0281 367.4829 379.8129 422.0559 440.4467 446.5309 470.6926 500.4605 577.2306 600.6345 604.4910 632.3847 663.2518 700.3358 719.3454 722.2250 773.1609 787.0831 807.2220 841.3315 876.5638 889.6631 894.0981 935.2906 964.1980 980.9190 1007.0202 1016.5102 1047.1821 1091.8276 1131.1783 1148.5911 1179.0955 1188.0291 1216.0400 1232.8521 1246.2900 1278.1586 1318.2448 1389.0480 1395.0284 1438.1220 1443.6008 1483.5331 1500.4701 1566.7253 1590.2108 1616.3361 1637.6459 1668.1632 3128.3577 3136.6419 3150.8793 3161.9397 3173.3119 3176.0056 3178.5519 3589.6234
redmass: 7.2183 4.3227 5.0819 8.5134 5.7527 4.6543 7.9310 1.1223 8.4619 6.1436 6.5554 3.3370 3.5042 5.2361 8.6773 3.1999 8.7575 6.9864 3.4821 6.3516 4.3483 6.5530 3.0954 7.5966 3.5510 1.4867 1.5056 6.9697 1.7152 6.6540 1.4340 1.3391 9.0972 1.3818 1.3441 3.5183 1.9674 2.5070 1.4186 1.3819 1.1502 1.9882 2.1094 3.4720 1.7888 1.5108 2.3274 7.2884 5.6892 2.7487 2.8202 3.0717 3.4395 6.3534 7.9678 6.4089 6.9146 11.9558 1.0905 1.0860 1.0895 1.0950 1.0984 1.0938 1.0942 1.0662
irintensity: 1.6293 4.4609 0.1561 0.0389 2.2155 0.9982 5.4916 146.9148 2.3749 0.6718 2.0274 0.3039 1.7777 12.0508 0.2415 0.7456 3.4100 5.2952 20.8848 4.7336 32.3568 0.5030 7.1743 5.6121 8.6599 44.2407 66.0296 39.8933 16.7062 25.4423 0.8239 2.0193 191.7960 2.3298 0.1846 8.5203 3.9299 3.8915 34.4916 213.3696 8.7380 52.7352 9.6892 25.6915 5.1359 30.5178 71.5403 29.9032 23.3702 23.8365 11.0961 86.7070 30.8063 58.7018 32.1837 41.8675 6.1750 388.8130 13.7236 2.8239 7.0947 7.2736 13.6801 13.3065 1.6563 57.0877
temp: 298.150 k
press: 1.00000 atm
elementType: 8 8 8 6 6 6 6 6 6 6 6 6 6 6 6 6 1 1 1 1 1 1 1 1
symmnumber: 1
zpe: 457125.5 jmol-1
zpe.correction: 0.174110 hartree
zpe.thermalcorrener: 0.185964 hartree
zpe.thermalcorrenthalpy: 0.186908 hartree
zpe.thermalcorrgfe: 0.136251 hartree
zpe.sumelectzpe: -724.785881 hartree
zpe.sumelectthermal: -724.774027 hartree
zpe.sumelectthermalent: -724.773083 hartree
zpe.sumelectthermalfe: -724.823740 hartree
dipole: 2.8214 -3.6659 -0.0005
dipole: 4.6259
quadrupole: -68.1548 -97.4549 -95.5012
quadrupole: 16.9783 0.0016 -0.0030
quadrupole: 18.8822 -10.4179 -8.4642 16.9783 0.0016 -0.0030
hfenergy: -724.9599911 hartree
pointgroup: C01 [X(C13H8O3)]
dipole: -1.0659862 -1.4751345 0.0001908 debye
dipolederiv: -1.3796935 -0.4825474 0.000132 0.0003224 -0.4669489 -0.0000344 -0.0000899 -0.0000009 -0.1915267 -1.1038266 -0.6111769 0.0000313 -0.9053892 -0.5729587 -0.0000109 0.0000301 -0.000012 -0.4237904 -0.9239856 -0.4344992 -0.0000844 -0.5500798 -1.0532703 -0.0001083 0.0004319 0.0003401 -0.334619 0.4583198 -0.0457859 0.0000226 -0.3109218 0.1563801 0.0000292 0.0000611 -0.0000781 0.0452471 -0.0640586 0.0757831 -0.000014 -0.0186743 0.0478823 -0.0000108 -0.0000153 0.0000169 0.0036389 -0.1195937 0.1217788 -0.0000069 -0.0884529 -0.5264445 0.0000106 0.0000434 -0.0000628 -0.0042679 0.4081386 0.4360295 -0.0000174 0.3727678 0.2449431 0.0000111 -0.0000068 0.000038 0.0695316 -0.2346398 -0.2570842 0.0000154 0.1127571 -0.0012143 -0.0000045 -0.0000013 -0.0000047 -0.1549309 -0.2633426 0.1714854 0.0000076 0.3249954 -0.0693823 -0.0000002 0.0000203 0.0000042 -0.1465957 1.7602573 0.5051766 -0.0000298 0.2797615 1.4593899 0.0001035 -0.0004156 -0.0001856 0.2657928 -0.0477078 -0.0901375 -0.0000099 0.2463032 0.0835214 0.0000171 0.0000167 -0.000011 -0.0997158 0.0952212 -0.2139859 0.0000083 0.0068364 0.0686279 -0.0000057 -0.000014 -0.0000556 -0.1288685 0.9661808 0.6540583 -0.000016 1.0144548 0.4547907 -0.0000071 -0.000017 -0.0000022 0.0692821 0.1672147 -0.0253541 -0.0000211 -0.0373422 0.1934083 0.0000212 -0.000024 0.0000198 -0.1241063 -0.180235 0.0491151 0.0000064 -0.4830779 -0.1053395 -0.00001 0.000026 -0.0000018 -0.1966076 0.0360658 -0.0404317 -0.0000342 -0.1917995 -0.184508 0.0000047 -0.0000446 0.0000002 -0.1617596 0.1158536 0.0490847 -0.000003 0.0129594 -0.0354015 0.0000041 0.0000022 -0.0000011 0.1587657 0.0128431 -0.1164731 0.0000022 -0.0794379 0.0138031 -0.0000045 -0.0000317 0.0000064 0.1474367 0.0608594 -0.0284373 -0.0000015 -0.0955882 0.050721 -0.0000063 0.0000104 -0.0000139 0.1558378 0.0981957 0.0051252 0.0000004 0.0306316 -0.0256171 0.0000056 -0.000005 -0.0000005 0.1717114 -0.1317556 0.0365573 -0.0000048 0.0107927 0.0818552 0.0000051 -0.0000086 0.0000155 0.1736723 0.0696489 0.0501658 0.0000078 0.0769928 -0.0960461 -0.0000196 0.0000196 -0.0000264 0.1544319 -0.1024266 0.0550019 0.0000245 0.0503972 0.0761675 -0.0000066 0.0000328 0.0000037 0.1629283 0.3024664 0.1365516 -0.0000156 0.2207914 0.2056406 0.0000166 -0.0000206 0.0000118 0.388512 unknown
polarizability: 243.4300989|-4.4809302|168.6840417|-0.0062563|0.0001487|56.6151831 unknown
InChI: InChI=1S/C13H8O3/c14-8-5-6-12-11(7-8)9-3-1-2-4-10(9)13(15)16-12/h1-7,14H
charge 0 multiplicity 1
24 atoms
O  0.005668 2.118292 0.00019
O  -4.097059 -1.711062 0.000203
O  2.206371 2.744911 -0.000179
C  0.735642 -0.66649 0.000198
C  -0.680744 -0.26749 0.000234
C  1.741188 0.352072 0.000206
C  -0.990484 1.121981 0.000177
C  -1.762537 -1.18567 0.000231
C  1.158576 -2.024623 0.000084
C  1.401294 1.794157 0.000434
C  3.11936 0.009309 0.000039
C  -2.320372 1.586835 0.000121
C  -3.092011 -0.728276 0.000193
C  2.52462 -2.356085 -0.000051
C  -3.379771 0.663354 0.000141
C  3.514437 -1.338288 -0.000079
H  -1.594412 -2.265439 0.000248
H  0.416741 -2.828618 0.000071
H  3.853153 0.821542 0.00005
H  -2.501394 2.66505 0.000079
H  -4.417357 1.019753 0.000108
H  2.825828 -3.40933 -0.000151
H  4.576731 -1.602731 -0.000185
H  -4.996667 -1.300657 0.000137
