program: Gaussian 09
title: 000263538
version: EM64L-G09RevD.01
frameworkgroup: C1[X(C10H11N3O2)]
method: RPBEPBE
basis: SDD
operation: Freq
keyword: #p
keyword: freq=noraman
keyword: PBEPBE/SDD
title: #p freq=noraman PBEPBE/SDD
converged: YES YES NO NO
title: Mulliken charges:
elementType: O O N N N C C C C C C C C C C H H H H H H H H H H H
charge: -0.183162 -0.215167 -0.227858 -0.384841 -0.402546 -0.161754 0.206775 0.220109 -0.658643 0.516143 -0.424091 -0.333838 -0.191047 -0.213989 -0.266437 0.265583 0.326958 0.255267 0.227310 0.222859 0.312901 0.217848 0.221408 0.222579 0.220445 0.227191
chargesum: 0.00000
title: Mulliken charges with hydrogens summed into heavy atoms:
elementType: O O N N N C C C C C C C C C C
charge: -0.183162 -0.215167 -0.227858 -0.057883 -0.089644 0.103828 0.206775 0.220109 0.046792 0.516143 -0.206243 -0.112430 0.031532 0.006455 -0.039245
polarizability: 1.73073782e+02 -7.80287085e+00 1.12196980e+02 3.71924919e-01 9.93390628e+00 1.05024233e+02
1716.lowfreq: -2.1698 -0.0008 -0.0007 -0.0006 6.8113 10.0717 25.1090 34.8835 51.9349
frequency: 24.9118 34.8308 51.8930 96.2479 129.0008 181.9238 219.8887 222.2754 260.5932 271.5277 302.7263 353.6005 397.9098 404.7381 420.3591 472.1235 502.1432 564.6805 587.1334 611.9814 615.4791 642.7682 689.7286 697.4171 731.5282 752.4956 755.4975 816.8225 823.7934 879.1362 928.7493 956.4117 971.1629 978.4421 981.7502 1023.5755 1043.4029 1084.9945 1089.4126 1106.8679 1144.3103 1170.8352 1184.2091 1196.6107 1251.3182 1277.3748 1314.2772 1317.7873 1371.4351 1380.0333 1389.8143 1394.7502 1433.9413 1471.7788 1474.0065 1484.7684 1494.8203 1601.7107 1620.5028 1680.7953 1737.1551 2990.8063 2994.7402 3096.0899 3107.5084 3117.7705 3129.3330 3142.2657 3154.5691 3169.7692 3550.2475 3599.2344
redmass: 3.8318 6.8504 4.2156 5.4159 7.3377 4.7751 1.1556 2.6512 1.9558 3.1595 4.0722 3.6268 5.2318 2.8671 5.0734 1.1076 2.8432 6.2141 5.8023 6.0486 6.5642 5.7163 1.9504 7.7662 4.3198 3.1068 2.3067 1.2768 4.6045 1.4826 2.3294 1.3702 2.5535 1.3199 5.6532 2.1439 2.7116 1.9064 2.0780 2.2212 2.3448 1.0498 1.1324 3.5894 2.5669 1.6726 1.4442 1.4425 1.6617 5.8449 1.8269 2.3220 2.2403 1.0494 1.0568 1.9174 1.9769 5.4613 6.3030 11.0375 10.5142 1.0829 1.0358 1.1011 1.1008 1.0872 1.0860 1.0923 1.0946 1.1012 1.0778 1.0800
irintensity: 2.1062 1.3161 3.7671 2.1124 0.7937 0.2937 1.4544 2.8719 30.4406 20.7569 15.5826 51.8660 11.8632 0.3483 8.4917 141.2325 12.8993 9.3515 11.5130 5.3613 18.2159 13.8624 36.0721 14.6170 13.4535 26.3541 65.7110 0.6378 2.0072 3.4021 14.0304 0.2788 14.9612 0.1703 1.1453 8.8330 32.6671 8.3578 18.7683 26.1335 57.5560 0.5123 6.7027 86.0370 96.8098 56.7739 42.3176 26.4759 14.2055 31.8933 5.5382 14.6888 5.7641 13.6981 6.7926 28.5294 94.1520 4.1558 126.0859 533.1834 172.0124 17.3647 17.4681 24.6917 16.2657 12.0829 1.5024 22.1045 42.8594 13.0806 32.9876 45.9201
temp: 298.150 k
press: 1.00000 atm
elementType: 8 8 7 7 7 6 6 6 6 6 6 6 6 6 6 1 1 1 1 1 1 1 1 1 1 1
symmnumber: 1
zpe: 527101.5 jmol-1
zpe.correction: 0.200762 hartree
zpe.thermalcorrener: 0.214384 hartree
zpe.thermalcorrenthalpy: 0.215328 hartree
zpe.thermalcorrgfe: 0.158971 hartree
zpe.sumelectzpe: -701.282817 hartree
zpe.sumelectthermal: -701.269195 hartree
zpe.sumelectthermalent: -701.268251 hartree
zpe.sumelectthermalfe: -701.324608 hartree
dipole: 3.2699 -0.0871 -0.9741
dipole: 3.4130
quadrupole: -65.2737 -95.8725 -88.4781
quadrupole: -0.1049 -6.9602 14.6236
quadrupole: 17.9344 -12.6644 -5.2700 -0.1049 -6.9602 14.6236
hfenergy: -701.4835794 hartree
pointgroup: C01[X(C10H11N3O2)]
dipole: 1.2727142 -0.0343765 0.4266832 debye
dipolederiv: -0.4529708 0.0387774 -0.0816329 -0.169342 -0.8905893 0.359927 0.0348293 0.3421931 -0.5552233 -0.6313169 -0.2847473 -0.0178065 -0.235464 -1.1239432 0.1391805 -0.0109237 0.2111845 -0.3951514 -0.1587792 -0.2766503 0.0990035 0.1129696 -1.0579697 0.3609595 0.1266138 0.2565549 -0.3412631 -1.0114278 -0.214224 -0.1004896 -0.1918812 -0.6459024 -0.1315438 -0.2188199 -0.1366442 -0.4967638 -0.8617479 0.1436795 0.294807 0.0613485 -0.2474744 0.2011781 0.6241438 0.1002148 -0.3087385 -0.0233874 0.077471 -0.2670993 0.1610322 0.4760806 0.0523807 -0.3286481 -0.0076544 0.1587219 0.8616693 0.4246468 0.0975441 0.5260159 1.3067018 -0.6138408 0.0151647 -0.3855596 0.5125893 1.2638471 0.331486 0.3499597 0.102605 1.6692771 -0.3895472 0.411972 -0.4856559 0.633482 0.0657931 -0.0265977 0.0156124 0.021019 -0.0688035 0.0047746 0.0269416 -0.0483919 0.019456 1.1987916 -0.2277177 -0.4503977 -0.4307074 0.1384824 0.0320028 -0.8018432 0.0609894 0.2436366 -0.4411305 0.1124391 0.1979642 0.0065727 -0.1401849 0.1194037 -0.0410576 0.1197349 0.0069435 -0.1333043 0.01343 0.0145891 0.2405023 -0.1767415 0.01455 0.3982293 -0.0000264 -0.1702879 0.1694149 -0.0240378 -0.0549131 0.0108698 -0.053542 0.1275838 0.0161551 0.1252319 0.1050097 0.2173372 0.0328762 0.0584697 -0.0369451 -0.060124 0.117857 -0.0737294 0.1190227 0.085182 -0.140626 -0.0477848 -0.0935777 -0.0351937 -0.2058884 0.0137336 -0.0656993 0.0131693 -0.1881643 -0.043108 -0.012565 0.0906587 -0.0148978 0.0076704 -0.0124586 0.0980111 0.0200148 -0.0057214 0.1973025 -0.0407872 -0.0608337 -0.0724773 0.1862987 0.0684647 -0.0556539 0.0894395 0.2924596 0.1106398 -0.0148397 0.0042423 -0.0591705 -0.0568225 0.0376654 0.0172875 0.0806571 0.0551348 -0.0343914 0.0090289 0.1211752 -0.0143746 0.0873083 -0.0005758 0.0909346 -0.025001 0.0046006 -0.0893731 0.0331784 -0.1185218 0.0560216 0.073646 0.014642 -0.1217507 -0.012398 0.0148574 0.0246604 -0.0120949 -0.0468966 0.0199663 0.2272183 -0.1198624 -0.0787097 -0.0509696 0.2535364 0.0844832 0.0187935 0.0341083 0.0035609 0.0909278 -0.1271341 0.0118065 -0.1215116 -0.0562867 -0.0778776 -0.043897 -0.0745879 -0.0644368 0.1172586 -0.0401345 -0.0897031 -0.0362985 0.0681609 -0.0954212 -0.0456115 -0.0800447 -0.0507699 0.1243841 -0.0488847 -0.0840985 -0.0493343 0.0643072 0.0827795 -0.0090301 -0.0142389 0.0061187 0.0832524 -0.1183549 0.0099618 -0.1176886 -0.0615311 -0.0818564 0.0447784 0.0829064 0.0470577 0.1394793 -0.0619668 0.0885863 -0.0612728 0.0610537 unknown
polarizability: 172.8004794|7.8269978|108.0884603|3.3418841|10.82892|109.4060552 unknown
InChI: InChI=1S/C10H11N3O2/c1-7-9(14)13(10(15)11-7)12-8-5-3-2-4-6-8/h2-7,11-12H,1H3
charge 0 multiplicity 1
26 atoms
O  1.667722 1.786064 -1.356029
O  0.976756 -2.520512 0.493546
N  0.982706 -0.369186 -0.588793
N  2.752802 -0.941439 0.685884
N  -0.261021 -0.458564 -1.186173
C  3.086244 0.399216 0.168808
C  1.851861 0.739627 -0.701477
C  1.529271 -1.425766 0.257992
C  3.326239 1.462973 1.260616
C  -1.445788 -0.114173 -0.488705
C  -2.69548 -0.449768 -1.07477
C  -1.414113 0.577768 0.748951
C  -3.895064 -0.096704 -0.425217
C  -2.624056 0.921411 1.388484
C  -3.871337 0.589995 0.811845
H  3.968512 0.354299 -0.500569
H  3.358121 -1.492474 1.291497
H  3.442679 2.452264 0.786136
H  2.474242 1.50448 1.960835
H  4.242859 1.236238 1.833334
H  -0.32141 -1.080185 -1.993499
H  -2.724959 -0.985107 -2.032013
H  -0.456884 0.848757 1.20555
H  -4.852623 -0.362762 -0.886927
H  -2.588926 1.454702 2.345334
H  -4.80535 0.860649 1.314564
