program: Gaussian 09
title: 000263429
version: EM64L-G09RevD.01
frameworkgroup: C1[X(C16H17N2O9P)]
method: RPBEPBE
basis: SDD
operation: Freq
keyword: #p
keyword: freq=noraman
keyword: PBEPBE/SDD
title: #p freq=noraman PBEPBE/SDD
converged: YES YES NO NO
title: Mulliken charges:
elementType: P O O O O O O O O O N N C C C C C C C C C C C C C C C C H H H H H H H H H H H H H H H H H
charge: 1.425539 -0.587660 -0.456957 -0.507433 -0.493321 -0.591180 -0.192809 -0.202179 -0.194739 -0.216365 0.014643 0.003263 -0.270618 -0.259732 0.371088 0.407811 0.184353 0.171133 -0.284323 -0.324893 -0.359138 -0.231567 -0.358984 -0.223209 -0.211655 -0.215689 -0.484659 -0.480838 0.345005 0.304402 0.272101 0.288656 0.365706 0.282047 0.243124 0.276677 0.238858 0.244112 0.241909 0.245092 0.258778 0.234900 0.247683 0.239755 0.241312
chargesum: 0.00000
title: Mulliken charges with hydrogens summed into heavy atoms:
elementType: P O O O O O O O O O N N C C C C C C C C C C C C C C C C
charge: 1.425539 -0.587660 -0.091250 -0.507433 -0.493321 -0.591180 -0.192809 -0.202179 -0.194739 -0.216365 0.014643 0.003263 0.074388 0.044670 0.371088 0.407811 0.184353 0.171133 -0.012221 -0.036237 -0.077090 0.011557 -0.082307 0.015649 0.032457 0.026219 0.254110 0.247912
polarizability: 2.45621979e+02 1.08562965e+01 2.47661139e+02 3.46561306e+01 -2.34681370e+01 2.25988305e+02
1716.lowfreq: -37.6513 -5.3795 -0.0010 0.0002 0.0013 5.1718 10.1972 11.4131 19.4570
frequency: -36.7452 8.8192 19.2659 21.8853 37.8125 42.5925 48.0602 61.5350 66.8146 69.4917 73.0289 83.9020 105.8000 120.2774 129.0897 134.5695 140.9121 154.8631 177.6719 195.0224 206.7834 220.4887 239.4658 263.2150 272.9199 292.9497 304.1598 326.2329 347.1220 365.3305 375.7022 379.2309 403.2849 411.7587 422.4249 443.4414 460.0660 480.7205 507.3048 545.2187 553.7641 563.4072 588.6267 608.0083 624.1429 655.0732 664.6669 670.4776 672.8381 685.6080 717.5222 729.5585 747.2257 780.4045 784.0444 785.4769 790.1203 837.7434 839.3303 886.1278 894.0639 906.3327 957.3704 963.1918 973.7552 977.6244 996.6285 1000.3920 1005.2363 1015.0310 1042.0472 1044.1074 1063.3097 1066.0360 1068.9476 1110.9850 1111.5818 1128.2309 1133.3276 1134.3801 1138.6935 1168.3782 1176.4021 1178.2063 1196.4258 1203.1540 1212.8205 1220.0502 1256.9914 1272.0272 1291.4397 1305.1067 1328.0033 1351.7469 1371.9876 1377.9777 1394.8582 1397.5387 1425.2941 1426.3446 1434.1640 1437.2614 1456.8914 1458.1829 1472.1957 1473.1208 1475.1106 1475.1898 1579.3876 1580.4864 1609.5556 1610.6498 2991.1308 2993.3173 3050.6890 3085.8872 3096.2432 3098.2743 3134.0702 3136.0058 3146.1953 3148.8280 3163.7566 3164.4651 3179.5082 3182.3097 3188.3469 3188.4076 3538.7165
redmass: 1.3720 5.0401 7.7562 7.9701 3.1235 5.1565 5.9884 3.8692 4.0092 5.4532 7.0564 7.2208 3.3162 1.5514 5.8549 4.8875 4.1759 3.9867 5.9894 8.2189 5.4962 6.4131 5.7297 5.5950 6.4097 6.0119 6.9806 8.6123 6.4702 6.8301 8.6104 6.7536 5.1936 3.8858 5.6430 2.7876 1.9553 3.6348 4.1550 5.4700 6.1242 3.7012 7.4730 6.7177 6.3342 7.6948 7.7901 5.5241 6.0146 10.6992 5.7720 3.3513 4.5312 8.9541 1.4746 1.6244 6.1399 5.1865 4.2264 1.5266 1.6584 3.4111 11.3587 10.7533 1.4141 1.4202 5.4563 1.3833 1.6415 3.2125 3.1553 3.0234 3.0471 3.2283 11.8874 1.2376 1.2423 1.2829 1.3229 2.0021 1.9276 1.5497 1.1341 1.0995 1.7658 2.0163 4.0284 5.6984 1.3943 1.4638 1.4083 1.4509 1.3337 2.7063 4.7143 2.8224 6.1225 3.9677 1.1207 1.1212 2.2774 2.3475 1.0503 1.0518 1.0535 2.4340 2.3161 1.1141 6.3934 6.4407 6.6702 6.7399 1.0293 1.0290 1.0840 1.0864 1.1058 1.1057 1.1042 1.1042 1.0871 1.0870 1.0925 1.0916 1.0951 1.0944 1.0983 1.0978 1.0648
irintensity: 1.0658 0.9970 1.3899 0.3140 0.8460 1.5387 3.1904 1.1866 5.1571 2.1309 1.4373 3.6071 0.0742 0.2112 2.9360 0.1542 1.4563 7.4939 2.4772 5.4761 2.5237 12.0318 2.9843 4.8526 4.5611 5.2672 16.1129 34.3521 1.7477 13.1182 10.2894 15.4543 8.7133 15.9058 13.3180 25.0688 85.2558 27.4696 2.5015 5.3033 6.1412 38.1165 19.3184 12.8855 3.2730 25.8800 3.0534 29.1824 36.5396 133.0936 52.6896 19.5945 73.9390 39.2243 70.6202 43.6636 41.3430 61.9097 62.1717 47.0744 56.1117 217.5822 181.8937 85.8467 1.3930 11.4866 81.1303 0.7996 3.1507 1.7987 1.7050 9.8456 12.8712 2.9935 102.2206 0.1911 1.9187 0.6450 0.6482 2.3862 1.8339 64.7648 16.4259 2.9410 68.0544 6.5927 97.1757 203.0871 4.9666 15.3474 20.2506 33.1155 41.1713 70.6146 108.9839 22.1088 11.6021 21.3569 2.7917 3.5217 14.9913 7.4476 13.0488 11.7708 21.8691 20.1819 26.3900 3.9927 5.9946 15.0980 7.7047 5.6260 46.6132 38.1725 4.8433 1.6897 18.0341 32.3308 9.1198 12.8087 4.3862 2.5430 13.6654 9.7244 0.7285 1.2195 3.6893 10.2031 29.4091
temp: 298.150 k
press: 1.00000 atm
elementType: 15 8 8 8 8 8 8 8 8 8 7 7 6 6 6 6 6 6 6 6 6 6 6 6 6 6 6 6 1 1 1 1 1 1 1 1 1 1 1 1 1 1 1 1 1
symmnumber: 1
zpe: 843234.3 jmol-1
zpe.correction: 0.321171 hartree
zpe.thermalcorrener: 0.348928 hartree
zpe.thermalcorrenthalpy: 0.349872 hartree
zpe.thermalcorrgfe: 0.258694 hartree
zpe.sumelectzpe: -1745.371120 hartree
zpe.sumelectthermal: -1745.343363 hartree
zpe.sumelectthermalent: -1745.342419 hartree
zpe.sumelectthermalfe: -1745.433596 hartree
dipole: -2.1843 1.4223 -3.7576
dipole: 4.5732
quadrupole: -141.4757 -157.8768 -188.7282
quadrupole: -8.4764 22.6755 -3.3234
quadrupole: 21.2179 4.8168 -26.0346 -8.4764 22.6755 -3.3234
hfenergy: -1745.6922907 hartree
pointgroup: C01 [X(C16H17N2O9P1)]
dipole: 0.6640419 -0.6663177 1.5337231 debye
polarizability: 227.4747594|-33.3254426|233.4677164|23.3438526|9.4710999|258.3289478 unknown
InChI: InChI=1S/C16H17N2O9P/c1-25-28(24,26-2)27-16(12-8-4-6-10-14(12)18(22)23)15(19)11-7-3-5-9-13(11)17(20)21/h3-10,15-16,19H,1-2H3
charge 0 multiplicity 1
45 atoms
P  3.222217 -0.934572 -0.638183
O  1.592978 -1.424676 -0.307682
O  -0.552604 -2.303249 -1.704171
O  3.762501 -0.596931 0.972492
O  3.915512 -2.446808 -1.055949
O  3.441723 0.204724 -1.712687
O  0.41028 3.895715 -0.926088
O  -0.35462 1.939715 -1.800593
O  -3.083102 0.675263 2.393215
O  -2.110948 -1.341287 2.006258
N  0.121796 2.643017 -0.824572
N  -2.674401 -0.25222 1.592895
C  0.484296 -0.425292 -0.51557
C  -0.757421 -1.378337 -0.588132
C  0.465383 0.574856 0.631805
C  -2.058586 -0.626345 -0.860246
C  0.324566 1.986056 0.494207
C  -2.902605 -0.061495 0.136445
C  0.646216 0.078107 1.948421
C  -2.434753 -0.416983 -2.208685
C  0.358703 2.85689 1.608552
C  0.652973 0.929744 3.06961
C  -4.049983 0.700633 -0.192632
C  -3.587204 0.318189 -2.552322
C  0.510705 2.326814 2.901531
C  -4.395993 0.888635 -1.542165
C  4.922931 0.319037 1.13837
C  3.862101 -3.583922 -0.101063
H  0.626924 0.058163 -1.494191
H  -0.816406 -1.929926 0.365116
H  0.798876 -0.996024 2.081397
H  -1.798875 -0.852166 -2.983238
H  0.351099 -2.696437 -1.583977
H  0.256108 3.931297 1.436677
H  0.764115 0.503685 4.07152
H  -4.652775 1.121717 0.616237
H  -3.846148 0.456014 -3.607122
H  0.510812 2.994764 3.768366
H  -5.287422 1.468269 -1.801477
H  4.871903 0.643533 2.187929
H  4.838002 1.186045 0.460567
H  5.867221 -0.220867 0.948541
H  4.451746 -4.373983 -0.588265
H  2.820089 -3.915837 0.047859
H  4.31397 -3.304524 0.866699
