program: Gaussian 09
title: 000024304
version: EM64L-G09RevD.01
frameworkgroup: C1[X(C12H15N3O)]
method: RPBEPBE
basis: SDD
operation: Freq
keyword: #p
keyword: freq=noraman
keyword: PBEPBE/SDD
title: #p freq=noraman PBEPBE/SDD
converged: YES YES NO NO
title: Mulliken charges:
elementType: O N N N C C C C C C C C C C C C H H H H H H H H H H H H H H H
charge: -0.295940 -0.128079 -0.180192 -0.126743 -0.357186 -0.366096 0.263155 -0.659522 -0.652221 0.100139 0.319829 -0.371942 -0.358488 -0.221714 -0.221852 -0.238565 0.210425 0.257980 0.218042 0.240289 0.256460 0.206942 0.218757 0.240593 0.216571 0.219107 0.250999 0.271172 0.227274 0.230406 0.230402
chargesum: 0.00000
title: Mulliken charges with hydrogens summed into heavy atoms:
elementType: O N N N C C C C C C C C C C C C
charge: -0.295940 -0.128079 -0.180192 -0.126743 0.111218 0.092235 0.263155 0.022637 0.024049 0.100139 0.319829 -0.120943 -0.087316 0.005560 0.008553 -0.008163
polarizability: 2.66881163e+02 6.21043928e+00 1.50975153e+02 2.65766108e+00 1.14850870e+01 8.55978591e+01
1716.lowfreq: -12.7045 -10.9512 -2.5798 -0.0004 -0.0001 0.0005 19.7965 32.2823 42.8534
frequency: 17.7700 31.8300 42.4820 46.5126 85.9264 89.0519 109.0808 179.6080 211.0568 214.9025 248.1077 271.7208 305.4722 312.5880 383.4150 397.0027 402.7813 475.4583 488.0468 555.1791 586.6065 614.2844 638.2103 674.4219 682.6974 698.4035 773.3083 778.6622 780.6624 852.4176 856.5732 869.5048 890.5429 931.3451 932.4853 975.4364 978.8610 985.3898 988.1297 1000.8973 1028.0338 1035.7639 1078.5754 1081.8796 1084.7868 1096.8985 1148.7436 1173.3277 1187.8523 1201.3070 1224.8079 1273.8912 1303.3380 1321.0309 1336.0687 1346.1042 1363.5933 1382.7388 1385.6215 1387.7044 1436.2754 1455.4564 1460.4642 1468.1271 1468.4866 1472.5252 1483.2324 1484.8196 1533.2083 1584.4898 1616.0860 1621.6323 2986.3446 2986.5925 3003.4861 3008.2176 3062.7232 3066.0697 3084.1796 3084.4421 3099.8209 3102.5853 3128.9198 3139.7046 3153.6932 3163.3997 3172.1101
redmass: 2.6085 3.1063 2.9815 4.4069 4.8070 3.3730 5.6309 2.1600 1.0999 4.6559 1.5740 2.7518 6.7546 2.6124 2.6942 5.5148 2.8782 4.4902 3.7639 4.3075 3.5615 6.4373 8.1301 8.9805 6.5093 1.8896 1.7962 1.2492 1.1508 4.9373 1.2482 10.5140 3.8822 2.2459 1.4253 5.9683 5.9751 1.3766 6.4501 1.3231 2.2453 2.8947 2.0908 1.7198 1.7305 1.7173 3.1774 1.0552 1.1216 2.4917 3.0878 2.2068 1.3175 1.3433 1.8863 1.2315 1.3163 6.9844 1.2155 1.2316 2.4157 2.4167 1.0778 1.0554 1.0471 1.0724 1.0618 1.0689 5.9758 6.2201 6.0513 7.0283 1.0355 1.0357 1.0612 1.0614 1.1022 1.1021 1.0997 1.0994 1.1022 1.1021 1.0850 1.0887 1.0932 1.0961 1.1010
irintensity: 0.0938 0.1865 0.4438 3.1589 0.6104 2.0314 0.8736 0.5288 0.4481 0.2718 0.2175 0.2431 0.3268 0.1138 2.8372 10.4244 0.1986 6.4684 2.4923 2.1290 1.8467 0.0550 4.2124 25.4291 19.2337 45.6033 54.1523 24.5772 6.2645 5.4721 0.0342 22.7639 1.9029 12.7343 5.6797 0.9401 146.0788 0.0531 6.7793 0.5280 1.7724 4.8320 18.3689 25.3267 5.3309 16.7402 5.1634 0.0261 1.0225 29.1049 21.0292 10.9464 53.1792 4.0957 91.7710 4.0678 14.3169 1.3831 2.4045 37.9055 19.3394 26.1042 14.2268 37.5829 3.4014 1.8423 6.8419 23.7650 1.6195 6.3978 26.7206 802.9101 25.1754 26.4075 36.1551 46.1998 0.8234 3.9557 45.7498 35.1035 23.8549 44.6327 0.7525 11.0742 22.9655 16.8541 16.2879
temp: 298.150 k
press: 1.00000 atm
elementType: 8 7 7 7 6 6 6 6 6 6 6 6 6 6 6 6 1 1 1 1 1 1 1 1 1 1 1 1 1 1 1
symmnumber: 1
zpe: 658699.7 jmol-1
zpe.correction: 0.250885 hartree
zpe.thermalcorrener: 0.266480 hartree
zpe.thermalcorrenthalpy: 0.267424 hartree
zpe.thermalcorrgfe: 0.205233 hartree
zpe.sumelectzpe: -704.540762 hartree
zpe.sumelectthermal: -704.525168 hartree
zpe.sumelectthermalent: -704.524224 hartree
zpe.sumelectthermalfe: -704.586414 hartree
dipole: -2.0270 4.2152 0.9955
dipole: 4.7820
quadrupole: -70.2493 -97.2169 -98.2808
quadrupole: -3.9503 -0.4101 -0.0566
quadrupole: 18.3330 -8.6346 -9.6985 -3.9503 -0.4101 -0.0566
hfenergy: -704.7916476 hartree
pointgroup: C01 [X(C12H15N3O1)]
dipole: 0.7697174 -1.6948028 0.2734022 debye
polarizability: 267.0700189|4.6043164|152.1211298|-1.5477359|-6.5743473|84.2630261 unknown
InChI: InChI=1S/C12H15N3O/c1-3-15(4-2)12-14-13-11(16-12)10-8-6-5-7-9-10/h5-9H,3-4H2,1-2H3
charge 0 multiplicity 1
31 atoms
O  0.429284 -0.446622 0.080535
N  2.815762 -0.329605 0.018721
N  1.382061 1.621972 -0.282233
N  -0.046919 1.764189 -0.289313
C  4.04957 0.472012 -0.174308
C  2.905614 -1.778961 0.303465
C  1.616574 0.307375 -0.065537
C  4.552408 1.118334 1.133053
C  2.864356 -2.6482 -0.972566
C  -0.588503 0.566265 -0.075104
C  -1.988481 0.177093 0.018383
C  -2.364062 -1.173789 0.254774
C  -2.997329 1.170616 -0.131852
C  -3.728328 -1.522577 0.338895
C  -4.356169 0.811984 -0.04638
C  -4.72919 -0.534363 0.189036
H  4.81704 -0.200463 -0.600881
H  3.833097 1.258232 -0.918522
H  3.85051 -1.948497 0.852475
H  2.078466 -2.061073 0.978222
H  3.795923 1.818711 1.5257
H  4.765931 0.356754 1.90516
H  5.482113 1.685545 0.94357
H  1.905791 -2.514637 -1.502767
H  3.684091 -2.381053 -1.663465
H  2.969789 -3.717116 -0.710655
H  -1.588086 -1.937066 0.370194
H  -2.695733 2.207152 -0.313457
H  -4.010861 -2.565277 0.52137
H  -5.127399 1.581242 -0.163052
H  -5.787821 -0.808577 0.25474
