program: Gaussian 09
title: 000263411
version: EM64L-G09RevD.01
frameworkgroup: C1[X(C22H22N4O4)]
method: RPBEPBE
basis: SDD
operation: Freq
keyword: #p
keyword: freq=noraman
keyword: PBEPBE/SDD
title: #p freq=noraman PBEPBE/SDD
converged: YES YES NO NO
title: Mulliken charges:
elementType: O O O O N N N N C C C C C C C C C C C C C C C C C C C C C C H H H H H H H H H H H H H H H H H H H H H H
charge: -0.193422 -0.278745 -0.216179 -0.210445 -0.024498 -0.422003 0.021054 0.014416 0.124838 0.175288 -0.470075 0.174003 -0.448336 -0.502699 -0.576950 -0.557188 0.413123 -0.061292 -0.791343 -0.391220 -0.388388 -0.249368 -0.247761 -0.243162 0.286881 0.262444 -0.291654 -0.500262 -0.370211 0.445565 0.207174 0.223354 0.215519 0.235104 0.229007 0.239553 0.249118 0.260105 0.255878 0.254050 0.219314 0.232836 0.227771 0.246885 0.226030 0.228773 0.226553 0.232230 0.384158 0.297867 0.335059 0.291250
chargesum: 0.00000
title: Mulliken charges with hydrogens summed into heavy atoms:
elementType: O O O O N N N N C C C C C C C C C C C C C C C C C C C C C C
charge: -0.193422 -0.278745 -0.216179 -0.210445 -0.024498 -0.037845 0.021054 0.014416 0.124838 0.175288 -0.039548 0.174003 0.002287 -0.034139 -0.067727 -0.047261 0.413123 -0.061292 -0.111421 -0.144335 -0.162358 -0.020595 -0.021209 -0.010932 0.286881 0.262444 0.006213 -0.165202 -0.078961 0.445565
polarizability: 6.30298258e+02 -2.74395384e+01 2.77887645e+02 2.86960808e+01 -1.53526007e-01 1.94620719e+02
1716.lowfreq: -6.2768 -0.0011 -0.0008 -0.0006 2.8978 4.4712 15.3643 20.5367 33.1208
frequency: 15.1841 20.3794 33.0697 40.7554 47.6474 60.9430 68.3604 79.9304 97.4609 119.1385 135.1158 139.6034 145.9910 160.2445 165.7856 186.9348 228.5558 255.7685 261.1252 269.8113 289.2740 300.6899 307.2213 320.7818 328.8549 357.8524 383.8679 393.2491 395.1709 406.4368 433.4727 444.2942 459.9296 477.4032 500.8200 512.8238 539.8568 555.0527 565.6639 581.3037 607.7159 617.8097 622.8900 634.2095 649.2924 660.0852 678.2078 704.0193 710.2980 716.5955 721.2267 751.2190 757.7158 768.9944 816.8941 832.7470 841.5404 850.8868 856.1306 859.7865 861.2589 879.4914 889.0090 918.1212 928.8572 959.9968 964.1526 983.2888 990.1360 992.2960 999.2113 1001.2923 1010.5794 1016.4361 1026.7314 1039.3718 1042.7960 1058.1766 1075.8154 1087.5426 1092.3598 1098.7402 1106.7105 1133.3634 1136.2875 1139.6449 1147.8196 1163.7956 1174.0482 1181.1073 1196.4525 1203.9359 1210.6625 1212.9860 1226.8707 1235.5198 1258.1787 1276.4533 1299.6518 1304.4129 1311.6814 1321.7299 1332.8860 1337.6231 1344.6946 1356.2637 1374.9745 1376.9840 1388.5978 1413.1888 1433.9257 1443.7448 1451.4044 1454.1779 1460.9506 1463.3293 1473.1788 1476.9019 1478.7646 1482.1585 1488.0809 1516.5011 1555.2372 1580.3114 1588.3403 1609.2175 1621.8720 1629.1124 2973.7866 2974.7535 2981.9253 2984.0149 2994.2504 2995.8089 3025.0964 3031.8210 3042.8982 3044.2142 3055.5414 3077.2809 3087.8579 3120.9845 3127.3426 3139.8611 3149.2658 3164.3361 3179.5677 3189.0511 3199.9016 3213.9283
redmass: 6.8892 6.3324 4.7802 4.6324 7.1699 12.3774 4.1719 7.3725 3.9520 2.5575 4.9827 5.6307 4.0146 3.7825 4.9314 7.4996 3.1819 2.3014 3.0411 3.7846 1.2752 3.3729 7.2447 3.5090 2.4817 9.3408 4.2358 8.1155 7.0818 2.8696 4.0585 3.7704 4.5187 2.7618 9.7447 3.5843 3.6618 3.6636 3.6713 3.3172 3.6495 6.0893 6.2749 4.6145 8.0007 4.4230 4.9438 8.0302 1.7487 5.4476 4.9087 9.1740 3.8721 1.9002 1.3489 1.3509 4.6304 1.9949 1.7097 1.3476 1.4145 2.3994 6.7999 2.9332 1.4176 2.0349 1.4011 1.3776 3.8017 2.4092 1.3528 2.3806 1.3126 2.2514 2.5137 1.9394 2.8014 2.7077 2.4719 2.0242 1.8686 4.0611 2.7543 2.8445 1.3378 1.3447 1.1797 9.4186 1.0505 1.9008 1.1257 1.2107 4.6983 1.7687 1.8249 1.8566 1.4194 1.6474 2.0153 2.1957 1.6675 1.4369 1.5349 3.2127 1.5066 5.8772 6.8075 4.1447 1.2557 3.5899 2.2269 1.1710 5.1641 1.1108 1.1139 1.0956 1.1637 1.1083 2.7905 1.5900 1.1385 4.0532 9.9824 4.9302 5.9961 6.0706 7.2807 7.9853 1.0625 1.0644 1.0558 1.0388 1.0618 1.0626 1.1016 1.0946 1.0981 1.1011 1.1031 1.0992 1.1005 1.0849 1.0868 1.0918 1.0951 1.1013 1.0892 1.0919 1.0963 1.0791
irintensity: 0.0700 0.8642 0.4029 0.2321 0.3748 0.4842 0.2735 1.3791 0.1033 1.9115 0.7287 1.1840 1.3748 0.9133 5.0198 4.8436 1.4995 1.7326 0.9788 0.4896 0.5232 0.3482 0.8889 0.7838 1.5478 2.0038 0.3339 6.7528 3.4133 0.2488 1.9304 1.1766 1.1788 4.2601 5.1145 13.2949 1.0543 7.7626 7.0179 4.7508 3.9100 0.0824 12.9202 1.3385 14.9692 4.6280 9.2435 7.5983 46.9775 5.9175 1.9186 3.1469 7.2036 44.5518 53.3509 42.9232 3.8236 0.5504 4.0030 1.4682 14.1508 11.4733 2.7357 8.0177 0.6374 10.2089 24.3163 0.5115 0.1510 4.0710 0.7846 6.2088 0.0071 6.2767 31.7411 11.8605 3.1099 38.0064 6.1419 5.9179 5.1747 61.7937 1.8539 2.8068 37.3110 2.4003 0.9166 322.8452 0.1725 10.4762 23.2994 8.2727 691.3509 3.9027 149.0289 86.9090 2.9015 12.6957 56.3030 87.7042 5.8191 3.2515 10.8637 228.5998 16.3515 89.2807 4.9514 12.1118 10.5373 20.8719 11.1050 4.2048 3.2427 3.3076 4.4192 16.6182 4.9453 9.1651 49.8565 42.6169 13.8717 66.4934 289.6141 237.1445 0.8579 35.5679 593.2524 19.0926 31.6995 13.0447 10.1899 40.0709 28.3312 23.7025 0.6539 13.8444 54.5703 18.4196 43.9461 53.7229 25.7988 5.8485 0.1154 18.4006 40.1184 29.5997 4.0562 20.8823 0.0224 59.3447
temp: 298.150 k
press: 1.00000 atm
elementType: 8 8 8 8 7 7 7 7 6 6 6 6 6 6 6 6 6 6 6 6 6 6 6 6 6 6 6 6 6 6 1 1 1 1 1 1 1 1 1 1 1 1 1 1 1 1 1 1 1 1 1 1
symmnumber: 1
zpe: 1063402.2 jmol-1
zpe.correction: 0.405029 hartree
zpe.thermalcorrener: 0.431081 hartree
zpe.thermalcorrenthalpy: 0.432025 hartree
zpe.thermalcorrgfe: 0.346707 hartree
zpe.sumelectzpe: -1369.120984 hartree
zpe.sumelectthermal: -1369.094931 hartree
zpe.sumelectthermalent: -1369.093987 hartree
zpe.sumelectthermalfe: -1369.179305 hartree
dipole: -11.5128 -1.1047 -1.5123
dipole: 11.6641
quadrupole: -228.0668 -189.3299 -167.1817
quadrupole: -0.4416 -2.8699 2.0395
quadrupole: -33.2073 5.5296 27.6778 -0.4416 -2.8699 2.0395
hfenergy: -1369.526012 hartree
pointgroup: C01 [X(C22H22N4O4)]
dipole: 4.5237823 0.4958471 -0.5903368 debye
polarizability: 629.5499762|-24.1646294|276.8335379|-36.1849928|9.7188407|196.4231083 unknown
InChI: InChI=1S/C22H22N4O4/c1-22(15-6-3-2-4-7-15)13-5-8-17-18(22)10-12-19(17)23-24-20-11-9-16(25(27)28)14-21(20)26(29)30/h2-4,6-7,9,11,14,24H,5,8,10,12-13H2,1H3
charge 0 multiplicity 1
52 atoms
O  -5.022396 -3.186127 -0.256426
O  -2.781737 -2.884363 -0.550972
O  -7.170361 2.59661 0.929605
O  -7.983678 0.468636 0.734402
N  -0.683178 0.393965 -0.359738
N  -1.745061 -0.509513 -0.345667
N  -3.990268 -2.416694 -0.297858
N  -7.016905 1.327621 0.717233
C  4.233689 0.418186 -1.062723
C  2.808992 -0.103773 -0.931467
C  4.190609 1.989303 -1.144195
C  1.715979 0.685311 -0.648082
C  3.21978 2.628575 -0.127506
C  1.763508 2.171345 -0.38776
C  2.419123 -1.564999 -1.107157
C  0.876134 -1.593852 -0.888019
C  5.089491 -0.011099 0.16119
C  0.508051 -0.134515 -0.612818
C  4.84502 -0.120454 -2.392461
C  4.49238 -0.280487 1.421074
C  6.505591 -0.07844 0.070886
C  5.277554 -0.611327 2.548737
C  7.294358 -0.405551 1.195661
C  6.684493 -0.67543 2.442291
C  -3.021465 -0.074052 -0.090731
C  -4.145229 -0.986584 -0.060446
C  -3.284988 1.315532 0.157611
C  -5.452281 -0.52179 0.205045
C  -4.572748 1.769817 0.418003
C  -5.655643 0.842079 0.440699
H  3.877989 2.273414 -2.17008
H  5.215269 2.37792 -0.995522
H  3.284067 3.730807 -0.189772
H  3.524017 2.346762 0.898689
H  1.339785 2.709677 -1.260013
H  1.105466 2.421252 0.465629
H  2.692181 -1.937709 -2.112393
H  2.953594 -2.210523 -0.38415
H  0.59409 -2.245166 -0.037709
H  0.341721 -1.983726 -1.776034
H  5.792018 0.396017 -2.62892
H  5.050447 -1.204189 -2.341624
H  4.151908 0.067733 -3.232421
H  3.401924 -0.231352 1.522186
H  7.006415 0.123522 -0.882023
H  4.789532 -0.816511 3.508369
H  8.385069 -0.450915 1.098051
H  7.296016 -0.931505 3.314487
H  -1.652088 -1.532661 -0.517571
H  -2.432452 1.996446 0.131827
H  -6.287838 -1.226008 0.224518
H  -4.779345 2.826385 0.606966
