program: Gaussian 09
title: 000024361
version: EM64L-G09RevD.01
frameworkgroup: C1[X(C14H20N2O)]
method: RPBEPBE
basis: SDD
operation: Freq
keyword: #p
keyword: freq=noraman
keyword: PBEPBE/SDD
title: #p freq=noraman PBEPBE/SDD
converged: YES YES NO NO
title: Mulliken charges:
elementType: O N N C C C C C C C C C C C C C C H H H H H H H H H H H H H H H H H H H H
charge: -0.248901 -0.171726 -0.462040 -0.362794 -0.362116 -0.435945 -0.449160 -0.465287 0.146331 0.164850 0.363490 0.347600 -0.418038 -0.429379 -0.826501 -0.830928 -0.235300 0.231634 0.193480 0.206890 0.232623 0.229530 0.215340 0.216797 0.231079 0.241331 0.229551 0.351561 0.230935 0.230176 0.214471 0.291517 0.216256 0.233079 0.233966 0.221916 0.223709
chargesum: 0.00000
title: Mulliken charges with hydrogens summed into heavy atoms:
elementType: O N N C C C C C C C C C C C C C C
charge: -0.248901 -0.171726 -0.110479 0.062321 0.077398 0.008925 -0.001283 0.005595 0.146331 0.164850 0.363490 0.347600 -0.187102 -0.199204 -0.104257 -0.141967 -0.011591
polarizability: 2.12696033e+02 -5.96469359e+00 1.75933732e+02 4.87461191e+00 3.39443423e+00 1.12531012e+02
1716.lowfreq: -18.2969 -8.9709 -0.0005 0.0004 0.0005 6.7865 26.8286 33.7732 42.8628
frequency: 26.4664 32.9515 42.7950 69.3624 87.4832 101.2066 114.5054 155.7157 166.0873 176.9859 201.5405 231.8733 270.3814 294.5982 317.1797 322.6322 345.6889 373.6448 464.4428 481.7733 516.1249 518.1671 534.3332 578.2939 605.9522 630.5295 640.3471 710.4484 746.9065 763.7064 775.9358 824.9514 838.1352 848.2094 866.7832 894.7538 897.0447 911.1030 936.8948 950.6974 969.8642 972.5307 988.5977 997.4180 1038.7362 1046.1277 1054.2452 1062.1124 1093.0426 1098.5876 1116.1185 1136.0100 1171.9495 1176.8906 1186.1532 1198.9471 1219.7623 1230.7040 1235.3669 1257.9022 1261.5541 1278.8989 1286.8969 1293.5876 1307.9196 1337.7960 1354.6015 1369.1089 1395.0341 1399.4670 1434.9138 1447.8959 1453.1217 1455.8442 1466.5396 1468.1400 1478.0199 1478.7638 1481.8154 1486.5527 1492.0499 1503.9576 1600.5287 1603.9380 1636.5672 2881.1849 2890.9095 2946.6988 2963.0168 2975.5505 3013.3124 3026.1085 3032.3273 3038.0378 3042.4535 3050.3366 3056.7159 3070.2129 3086.1970 3086.5144 3094.8127 3120.1390 3130.4243 3155.6988 3292.2126
redmass: 3.5781 1.9136 4.0307 2.7156 2.7786 4.4766 4.5289 1.7117 1.6625 1.4549 1.8430 2.3756 3.0144 3.4080 4.0759 2.5957 2.3719 4.6862 3.4910 4.4803 3.1413 4.1341 4.3861 3.9544 4.1189 2.8775 2.9891 3.6871 4.6255 1.5404 1.2224 1.1771 3.7325 1.5330 3.2308 2.5128 1.3106 3.5763 2.4075 2.5188 1.5485 1.3600 1.6526 1.9435 1.6618 1.6977 1.5936 2.6642 1.5615 1.7236 2.9044 2.1942 2.1250 1.2199 1.3410 1.6004 1.2000 2.1896 1.8965 1.3346 1.6595 2.4344 1.2067 1.3326 1.3954 1.4836 1.4510 6.3776 1.2775 1.2409 2.0870 1.1812 1.5165 1.1118 1.0929 1.1463 1.4495 1.1432 1.1004 1.1979 1.3262 1.2933 7.0092 5.5315 7.5712 1.0711 1.0709 1.0646 1.0402 1.0366 1.0602 1.0654 1.0955 1.0943 1.0888 1.0892 1.0965 1.1047 1.0993 1.0980 1.1054 1.0854 1.0918 1.0995 1.0757
irintensity: 0.0053 0.0888 0.8584 0.7639 1.7937 3.8271 1.0374 1.6804 5.2054 2.1662 6.3639 1.6927 1.4300 3.1328 1.8059 2.0864 9.6710 0.9024 12.4907 22.6401 0.1464 0.1803 1.4978 5.1031 5.2704 0.1574 0.2905 5.6855 1.5025 0.0437 55.1600 56.4196 19.1885 23.0210 12.3932 7.3447 0.1174 5.0483 13.7233 4.4111 4.1641 0.9465 3.7450 12.8107 7.2702 2.3377 9.0547 2.5718 0.3227 16.3483 7.2637 43.3844 9.1884 3.9630 4.2067 2.0390 0.6973 6.7803 12.9000 16.1806 1.7811 2.8806 3.6535 5.1794 6.8077 9.1409 10.0182 15.2822 10.2485 24.5511 24.6062 41.8152 7.8686 33.5032 5.5689 8.3663 181.9103 11.8599 37.3795 16.3177 120.1397 134.3170 13.3471 10.9683 201.9398 54.0857 142.3403 54.4893 39.4793 27.8743 20.0346 52.8779 8.2902 14.9399 65.5973 9.0444 14.1830 1.0295 18.7390 30.7539 76.4366 0.2186 27.5580 37.2120 251.1254
temp: 298.150 k
press: 1.00000 atm
elementType: 8 7 7 6 6 6 6 6 6 6 6 6 6 6 6 6 6 1 1 1 1 1 1 1 1 1 1 1 1 1 1 1 1 1 1 1 1
symmnumber: 1
zpe: 826883.2 jmol-1
zpe.correction: 0.314943 hartree
zpe.thermalcorrener: 0.331978 hartree
zpe.thermalcorrenthalpy: 0.332922 hartree
zpe.thermalcorrgfe: 0.268745 hartree
zpe.sumelectzpe: -728.940094 hartree
zpe.sumelectthermal: -728.923059 hartree
zpe.sumelectthermalent: -728.922115 hartree
zpe.sumelectthermalfe: -728.986293 hartree
dipole: 3.7789 2.4520 -2.1169
dipole: 4.9773
quadrupole: -88.6721 -102.3639 -107.9599
quadrupole: -2.3818 2.2085 7.7534
quadrupole: 10.9932 -2.6986 -8.2946 -2.3818 2.2085 7.7534
hfenergy: -729.2550375 hartree
pointgroup: C01 [X(C14H20N2O1)]
dipole: -1.3110569 -1.4542486 -0.0301536 debye
polarizability: 213.2522482|1.9937038|144.344828|6.2576331|-31.53157|143.5637006 unknown
InChI: InChI=1S/C14H20N2O/c1-11-6-5-7-12(2)14(11)15-13(17)10-16-8-3-4-9-16/h5-7,15H,3-4,8-10H2,1-2H3
charge 0 multiplicity 1
37 atoms
O  -0.058117 2.859938 -0.549708
N  -2.546321 0.160666 -0.5813
N  0.114653 0.499844 -0.455819
C  -3.637191 -0.436686 -1.402627
C  -3.053338 0.116447 0.820136
C  -4.115745 -1.642383 -0.5519
C  -3.718135 -1.2794 0.922265
C  -2.037868 1.475584 -1.023022
C  -0.554457 1.698705 -0.638467
C  1.491815 0.292277 -0.11831
C  2.537349 0.882834 -0.889188
C  1.782589 -0.573847 0.980565
C  3.877313 0.621148 -0.505403
C  3.133272 -0.821756 1.315641
C  2.255251 1.731399 -2.111411
C  0.662592 -1.205651 1.789284
C  4.180852 -0.218725 0.585607
H  -3.255626 -0.728007 -2.39704
H  -4.473999 0.287686 -1.552525
H  -3.804273 0.924478 0.996966
H  -2.228183 0.263981 1.538402
H  -3.603598 -2.566577 -0.869302
H  -5.201132 -1.805363 -0.665035
H  -4.589533 -1.257786 1.598738
H  -3.004313 -2.020441 1.321445
H  -2.098489 1.533576 -2.126786
H  -2.617292 2.333343 -0.617075
H  -0.550237 -0.296714 -0.458576
H  4.688127 1.074396 -1.08778
H  3.361591 -1.481084 2.161335
H  1.504333 1.251052 -2.767362
H  1.836642 2.711602 -1.819874
H  3.175902 1.890612 -2.698218
H  1.068302 -1.770516 2.645337
H  -0.028951 -0.437298 2.18317
H  0.055549 -1.911361 1.187033
H  5.224266 -0.410173 0.859502
