program: Gaussian 09
title: 000263390
version: EM64L-G09RevD.01
frameworkgroup: C1[X(C16H18O5)]
method: RPBEPBE
basis: SDD
operation: Freq
keyword: #pfreq=noraman
keyword: PBEPBE/SDD
title: #p freq=noraman PBEPBE/SDD
converged: YES YES NO NO
title: Mulliken charges:
elementType: O O O O O C C C C C C C C C C C C C C C C H H H H H H H H H H H H H H H H H H
charge: -0.162438 -0.150103 -0.221003 -0.267232 -0.211548 -0.370454 -0.435657 -0.328654 -0.426195 -0.435331 0.137618 0.553905 0.076026 -0.445125 -0.371386 0.157567 -0.354720 -0.379423 0.313111 -0.501456 -0.538475 0.296129 0.235098 0.216436 0.305383 0.222125 0.236062 0.228358 0.238607 0.235567 0.236822 0.247727 0.236790 0.246473 0.245828 0.249278 0.243585 0.222169 0.218536
chargesum: 0.00000
title: Mulliken charges with hydrogens summed into heavy atoms:
elementType: O O O O O C C C C C C C C C C C C C C C C
charge: -0.162438 -0.150103 -0.221003 -0.267232 -0.211548 -0.074325 0.015877 -0.023271 0.031993 0.031634 0.137618 0.553905 0.076026 -0.209558 -0.134565 0.157567 -0.106993 -0.142633 0.313111 0.240123 0.145816
polarizability: 2.70705609e+02 -5.14308370e+00 1.51341593e+02 1.22745970e+01 1.70667909e+01 1.53004109e+02
1716.lowfreq: -8.5126 -2.3979 -0.0007 -0.0005 0.0007 7.7087 15.0379 26.7392 31.8222
frequency: 14.8603 26.7309 31.7348 40.0433 44.4831 88.7624 93.7696 106.6296 110.6603 133.9953 148.1761 157.4397 184.3924 192.4570 238.6849 241.2579 252.3468 264.4385 309.1587 329.1317 350.1944 389.6528 414.1080 416.5957 446.5434 457.0049 461.8007 514.9908 532.6226 550.7697 605.0683 629.8914 666.9666 716.6025 730.5900 756.0973 759.7993 767.7045 805.1738 814.4631 829.1818 839.7369 855.3035 869.3528 903.4174 920.2402 942.1167 957.1648 961.7669 989.5560 1005.7118 1020.9416 1031.9603 1069.4398 1079.8530 1091.7781 1111.9009 1112.1799 1114.8656 1141.8637 1149.5029 1156.3447 1179.1715 1183.1054 1189.4930 1213.7563 1230.9721 1242.0758 1255.5707 1288.5035 1297.8223 1312.1938 1318.0798 1344.7341 1347.6409 1361.3978 1389.9628 1420.0293 1420.8055 1436.0075 1454.1474 1458.1274 1464.4211 1466.2804 1467.4395 1473.8371 1476.0336 1504.7618 1585.3728 1601.7883 1609.3595 1623.4189 1629.4620 2957.3740 2967.0920 2984.8507 2987.7918 2992.0493 3008.3623 3041.5160 3043.8193 3050.1599 3059.8841 3062.6801 3111.8267 3121.6629 3122.5882 3139.6990 3161.9269 3162.3153 3166.8753
redmass: 5.3886 5.4257 4.1587 7.0469 4.6060 2.5811 1.3809 4.1539 4.8591 4.4760 3.6119 5.6985 2.9016 2.9157 4.5726 1.7497 2.5402 4.6344 1.8581 5.7130 5.8386 5.4892 2.9494 4.9276 4.5355 5.9253 3.6895 4.9015 3.5885 3.9156 4.7349 6.8658 3.3984 4.9337 3.7273 5.3283 4.9355 3.8834 2.4440 1.8172 1.6644 3.0978 2.3707 2.1198 3.0503 2.6401 1.5468 2.5638 1.5533 8.6365 2.6119 2.7380 3.1761 1.9040 2.5522 2.4385 1.2618 1.2654 1.3981 1.3408 1.4319 1.3427 1.3731 1.2601 5.2817 1.8775 3.3063 1.2993 1.3601 1.3379 1.3328 1.3107 1.5112 1.7485 1.5760 1.4577 3.7976 1.2203 2.6987 1.1754 1.0495 1.0505 1.0844 1.0504 1.0821 1.0768 1.0892 2.4811 7.0404 9.5415 9.8459 7.0228 8.5617 1.0330 1.0796 1.0620 1.0607 1.0640 1.0297 1.0992 1.1038 1.1019 1.1012 1.0867 1.1047 1.0897 1.0991 1.0877 1.1049 1.0951 1.0954
irintensity: 1.6113 1.5308 0.0441 1.5630 2.3130 3.1304 2.5732 1.5937 2.6930 2.4538 2.5067 2.7062 2.6235 3.8766 1.5056 0.4892 3.0542 2.7560 1.8213 26.9451 3.7176 2.3515 0.0991 3.1968 3.0899 4.9983 6.8136 44.6270 11.9210 16.3453 13.2751 2.3076 0.9777 3.6671 1.9370 9.2114 3.9407 2.2722 26.2804 10.0741 44.9587 10.5749 5.6185 14.8330 9.0473 1.1863 3.8462 5.9124 0.9594 40.0802 16.3537 57.6275 143.9603 52.2413 171.0571 18.6611 0.6736 0.3581 13.1749 28.8888 18.9760 1.1074 68.9129 75.6367 114.9069 2.7486 187.6018 6.2243 6.7310 5.8015 25.3848 1.9494 32.7289 4.3126 4.8739 8.2548 17.4259 8.9424 2.3850 8.8893 16.3727 12.3360 9.0474 13.0544 17.4600 61.7572 7.8022 126.4780 6.8390 25.4689 273.9553 89.3778 37.3452 70.8235 5.2368 21.2219 23.1014 32.2984 25.1394 26.2998 50.9247 21.2043 25.5817 4.4719 20.5672 13.7461 29.3124 15.8041 11.1574 15.5044 3.1817
temp: 298.150 k
press: 1.00000 atm
elementType: 8 8 8 8 8 6 6 6 6 6 6 6 6 6 6 6 6 6 6 6 6 1 1 1 1 1 1 1 1 1 1 1 1 1 1 1 1 1 1
symmnumber: 1
zpe: 809502.3 jmol-1
zpe.correction: 0.308323 hartree
zpe.thermalcorrener: 0.329152 hartree
zpe.thermalcorrenthalpy: 0.330096 hartree
zpe.thermalcorrgfe: 0.255627 hartree
zpe.sumelectzpe: -995.030128 hartree
zpe.sumelectthermal: -995.009299 hartree
zpe.sumelectthermalent: -995.008355 hartree
zpe.sumelectthermalfe: -995.082824 hartree
dipole: -1.7146 2.1446 -0.5152
dipole: 2.7937
quadrupole: -90.1830 -116.7047 -129.7723
quadrupole: 10.9284 10.3348 -1.3804
quadrupole: 22.0370 -4.4847 -17.5523 10.9284 10.3348 -1.3804
hfenergy: -995.3384512 hartree
pointgroup: C01 [X(C16H18O5)]
dipole: -0.6758144 0.857751 -0.1247947 debye
polarizability: 270.9704138|-5.9732108|148.5742057|10.4235978|16.7719189|155.5066914 unknown
InChI: InChI=1S/C16H18O5/c1-20-11-8-6-10(7-9-11)12-4-3-5-13(14(12)17)15(18)16(19)21-2/h6-9,12-13H,3-5H2,1-2H3
charge 0 multiplicity 1
39 atoms
O  -0.119469 -0.015067 2.127467
O  -2.506071 -0.53731 -1.108657
O  -4.923335 -1.408623 -0.224131
O  5.800823 -0.974535 -0.114846
O  -4.800152 0.07196 1.572622
C  0.25389 0.609717 -0.237598
C  0.098647 2.112846 -0.678176
C  -2.073477 0.783439 0.93718
C  -1.380727 2.518656 -0.852185
C  -2.184034 2.276112 0.44109
C  -0.577479 0.394255 1.031273
C  1.71133 0.18921 -0.138195
C  -2.881299 -0.121513 0.015534
C  2.265473 -0.678788 -1.115737
C  2.566222 0.67473 0.880076
C  -4.295173 -0.463967 0.556577
C  3.623409 -1.046616 -1.085817
C  3.931595 0.316309 0.929679
C  4.462678 -0.548111 -0.059635
C  -6.293453 -1.793372 0.206473
C  6.702034 -0.504484 0.938644
H  -0.251875 0.011401 -1.02439
H  0.652827 2.246025 -1.625007
H  0.588253 2.761396 0.075454
H  -2.505652 0.71848 1.949945
H  -1.446184 3.58952 -1.125146
H  -1.824612 1.946319 -1.689104
H  -1.788664 2.914756 1.255047
H  -3.249911 2.542496 0.313872
H  1.622586 -1.076605 -1.910818
H  2.16381 1.324314 1.66459
H  4.05193 -1.717025 -1.836942
H  4.559619 0.703904 1.737574
H  -6.591576 -2.58365 -0.494773
H  -6.966322 -0.922152 0.139371
H  -6.273743 -2.161701 1.245756
H  7.676329 -0.96016 0.708065
H  6.362114 -0.837119 1.938985
H  6.795439 0.599351 0.928385
