program: Gaussian 09
title: 000263388
version: EM64L-G09RevD.01
frameworkgroup: C1[X(C15H20O3)]
method: RPBEPBE
basis: SDD
operation: Freq
keyword: #pfreq=noraman
keyword: PBEPBE/SDD
title: #p freq=noraman PBEPBE/SDD
converged: NO YES NO NO
title: Mulliken charges:
elementType: O O O C C C C C C C C C C C C C C C H H H H H H H H H H H H H H H H H H H H
charge: -0.478507 -0.256274 -0.273018 0.280950 -0.225000 -0.496235 -0.460236 -0.395521 -0.409376 -0.596738 0.416459 0.254559 -0.383075 -0.383026 -0.241813 -0.262504 -0.244413 -0.503674 0.228277 0.223666 0.216250 0.186677 0.218490 0.202170 0.202028 0.204342 0.195189 0.290825 0.243890 0.360281 0.267740 0.223094 0.222559 0.220209 0.224788 0.245909 0.237055 0.244000
chargesum: 0.00000
title: Mulliken charges with hydrogens summed into heavy atoms:
elementType: O O O C C C C C C C C C C C C C C C
charge: -0.118226 -0.256274 -0.273018 0.280950 0.003278 -0.056319 -0.055068 0.008677 -0.009845 -0.062023 0.416459 0.254559 -0.115335 -0.159931 -0.019254 -0.042295 -0.019625 0.223290
polarizability: 1.86132203e+02 -2.16384623e+01 1.54383372e+02 8.86311453e-01 -1.17855840e+00 1.54007603e+02
1716.lowfreq: -9.7254 -0.0011 -0.0010 -0.0007 8.1676 17.1792 27.2197 38.9650 57.4117
frequency: 26.8154 38.9313 57.3365 71.6097 92.1538 101.1043 121.3886 158.2483 185.9424 206.8140 225.1287 247.1569 271.8228 297.7845 310.9122 346.9544 363.1980 403.1447 421.3335 428.0732 454.1472 482.0479 532.7172 544.5276 566.6308 583.1209 617.3101 625.6156 689.9944 703.3783 732.4214 771.2948 781.4510 821.6455 833.2084 851.7084 861.1729 878.1596 905.0510 921.9014 933.5814 950.4632 970.5309 973.8743 985.9583 990.7997 992.8373 1029.4583 1037.9436 1047.5361 1076.7243 1091.0793 1105.9192 1113.1885 1131.5973 1142.1997 1148.9423 1158.8538 1171.5763 1191.0471 1194.8659 1208.1312 1231.4510 1243.8406 1261.9215 1287.3432 1301.4468 1314.3405 1325.0184 1327.6231 1338.7548 1341.7546 1357.8929 1381.0921 1388.7807 1422.6410 1424.9657 1438.1587 1453.5576 1462.5610 1464.2618 1469.6778 1477.0605 1481.7828 1484.7306 1588.3982 1609.8151 1612.3701 2967.3908 2970.2590 2971.3462 2978.0188 2983.7627 2996.1022 3008.8551 3028.7706 3031.2448 3038.7209 3046.7477 3082.3545 3112.7250 3118.0265 3128.2044 3141.7425 3154.7469 3154.8394 3168.2306 3410.9802
redmass: 4.4321 3.7724 5.6858 3.5368 3.2306 1.1529 3.9757 3.1536 3.5840 4.3743 2.6682 5.6941 3.3746 4.5705 2.5109 5.9491 1.9528 2.8174 3.4490 3.0889 2.8416 3.5656 2.0811 2.8665 2.0535 1.5443 6.2078 4.1980 4.1281 1.6693 3.4435 2.1315 2.0941 2.0461 3.7403 1.2527 2.5529 2.3961 1.7635 1.5904 2.4677 2.5633 2.6756 1.4208 2.2993 2.1190 2.1791 2.3566 2.4835 1.7862 1.6456 1.6022 2.0046 1.2771 2.0365 1.9809 1.4499 2.9659 1.0568 1.4333 1.1411 2.2667 1.3164 1.2905 1.3486 1.3726 1.6278 1.6947 1.3272 1.3916 1.4447 1.4654 1.4517 5.6418 1.5955 1.1908 1.1223 2.1279 1.0498 1.0514 1.0890 1.0912 1.0865 1.1216 2.0876 5.9172 7.5903 6.0161 1.0706 1.0610 1.0637 1.0744 1.0625 1.0641 1.0295 1.0966 1.0978 1.1015 1.1026 1.0943 1.1048 1.0842 1.0880 1.0931 1.1033 1.0990 1.0983 1.0658
irintensity: 0.5699 0.2051 0.1146 0.6039 0.6420 0.6090 2.9584 1.7571 2.8451 1.5028 4.1316 1.1368 12.8677 7.5074 0.5573 20.3672 0.8437 0.2376 1.5809 5.5954 1.1511 1.4036 7.4854 12.7506 66.1264 89.3368 0.1219 7.8508 2.0276 59.0287 11.9577 34.0507 4.1230 3.1148 6.4122 0.8680 12.5404 1.7813 13.7789 1.6384 12.4213 30.7859 3.6201 0.6221 13.2833 0.2796 1.1866 13.1030 26.7627 3.6829 17.0835 14.8859 30.2136 2.5744 2.9695 99.2694 3.0708 168.4934 0.4015 16.1647 1.2853 0.5120 7.3190 12.3747 4.4889 3.3564 26.2047 104.5418 8.3498 2.5576 6.2492 5.5732 5.0643 3.9358 71.3906 23.1817 31.8165 7.6354 14.8473 9.6915 6.6428 7.8976 29.2302 1.6279 21.2670 1.7118 120.6067 7.1076 9.1993 35.3032 28.3403 22.5982 29.2123 13.3438 29.6932 62.3409 54.6463 7.1388 89.3568 7.9227 22.2117 1.8563 6.8947 40.6276 9.4135 36.3538 9.4493 110.0761
temp: 298.150 k
press: 1.00000 atm
elementType: 8 8 8 6 6 6 6 6 6 6 6 6 6 6 6 6 6 6 1 1 1 1 1 1 1 1 1 1 1 1 1 1 1 1 1 1 1 1
symmnumber: 1
zpe: 838371.5 jmol-1
zpe.correction: 0.319319 hartree
zpe.thermalcorrener: 0.336646 hartree
zpe.thermalcorrenthalpy: 0.337590 hartree
zpe.thermalcorrgfe: 0.273469 hartree
zpe.sumelectzpe: -807.908332 hartree
zpe.sumelectthermal: -807.891005 hartree
zpe.sumelectthermalent: -807.890061 hartree
zpe.sumelectthermalfe: -807.954182 hartree
dipole: -2.2560 0.1469 -2.4795
dipole: 3.3554
quadrupole: -97.9748 -101.5821 -109.3355
quadrupole: 1.1909 3.5849 2.6988
quadrupole: 4.9893 1.3821 -6.3714 1.1909 3.5849 2.6988
hfenergy: -808.2276511 hartree
pointgroup: C01 [X(C15H20O3)]
dipole: -0.9139053 -0.118351 0.9452626 debye
polarizability: 187.6541768|20.3888976|153.0165771|1.9230485|-0.7133322|153.8524241 unknown
InChI: InChI=1S/C15H20O3/c1-18-14(16)11-15(17)10-6-5-9-13(15)12-7-3-2-4-8-12/h2-4,7-8,13,17H,5-6,9-11H2,1H3
charge 0 multiplicity 1
38 atoms
O  -0.322768 0.273135 -1.954183
O  -3.103022 1.445976 1.174412
O  -2.609545 1.661636 -1.082964
C  -0.626321 -0.537446 -0.758066
C  0.713442 -1.274931 -0.395319
C  -1.717783 -1.579669 -1.137584
C  0.477696 -2.384136 0.665375
C  -1.936116 -2.679627 -0.075444
C  -0.603175 -3.397905 0.229655
C  -1.076796 0.405076 0.399729
C  1.849819 -0.312153 -0.029695
C  -2.309029 1.215799 0.058452
C  2.527891 0.395273 -1.059098
C  2.260359 -0.09098 1.311981
C  3.578039 1.289765 -0.759268
C  3.312197 0.804102 1.616694
C  3.976557 1.499641 0.582148
C  -4.308939 2.28734 0.953837
H  0.998525 -1.776435 -1.343953
H  -1.386551 -2.046933 -2.0857
H  -2.66648 -1.054038 -1.362478
H  0.167684 -1.938008 1.632078
H  1.436578 -2.902514 0.85602
H  -2.690676 -3.402197 -0.441189
H  -2.346521 -2.242193 0.857752
H  -0.745625 -4.160996 1.019149
H  -0.262473 -3.934317 -0.679813
H  -0.250741 1.117513 0.595317
H  -1.258546 -0.145408 1.336977
H  -1.102951 0.879764 -2.103012
H  2.20665 0.250378 -2.09489
H  1.769812 -0.62533 2.133148
H  4.085172 1.823418 -1.571448
H  3.613254 0.953731 2.660223
H  4.794177 2.191085 0.816057
H  -4.015594 3.276858 0.56598
H  -4.775612 2.368654 1.944977
H  -4.984588 1.79957 0.231841
