program: Gaussian 09
title: 000263380
version: EM64L-G09RevD.01
frameworkgroup: C1[X(C14H18O3)]
method: RPBEPBE
basis: SDD
operation: Freq
keyword: #pfreq=noraman
keyword: PBEPBE/SDD
title: #p freq=noraman PBEPBE/SDD
converged: YES YES NO NO
title: Mulliken charges:
elementType: O O O C C C C C C C C C C C C C C H H H H H H H H H H H H H H H H H H
charge: -0.476150 -0.402698 -0.265142 0.279236 -0.225542 -0.499131 -0.460295 -0.394900 -0.409209 -0.577125 0.420191 -0.382352 -0.383464 0.193592 -0.241168 -0.261488 -0.243898 0.229065 0.224569 0.218389 0.186929 0.219336 0.203812 0.201697 0.205628 0.195752 0.248022 0.298258 0.360362 0.264485 0.221869 0.223201 0.221039 0.225490 0.381641
chargesum: 0.00000
title: Mulliken charges with hydrogens summed into heavy atoms:
elementType: O O O C C C C C C C C C C C C C C
charge: -0.115788 -0.021057 -0.265142 0.279236 0.003523 -0.056174 -0.054030 0.010609 -0.007828 -0.030845 0.420191 -0.117867 -0.161595 0.193592 -0.017968 -0.040449 -0.018408
polarizability: 1.80894142e+02 -1.58714351e+01 1.33232939e+02 -1.46237092e+00 -4.84800836e+00 1.45180325e+02
1716.lowfreq: -10.4487 -0.0007 0.0005 0.0010 6.5089 14.9037 34.2847 44.1920 57.6233
frequency: 34.0443 44.1372 57.5957 83.4129 98.2975 141.1153 171.6423 214.3083 226.7949 249.3606 291.9132 306.9995 335.8699 359.4172 403.8415 421.5802 428.4839 451.8842 478.5552 515.0416 534.3475 535.3167 561.0877 614.5864 617.5015 635.1318 664.4825 704.4326 739.5562 771.4733 778.5240 819.9766 853.1400 855.8989 867.7633 881.7642 905.8535 924.9208 941.8713 958.2266 974.8838 981.4006 991.1549 993.0776 1027.1802 1034.0325 1048.1015 1069.3602 1081.1277 1094.3201 1113.0948 1131.5300 1148.8355 1171.7778 1191.2337 1194.4726 1207.7524 1225.5632 1239.2900 1250.0836 1262.1739 1288.1384 1307.6446 1323.4285 1328.1676 1339.3857 1342.3246 1348.8025 1357.6012 1381.2876 1385.1668 1423.4387 1438.5915 1464.6885 1466.8036 1475.5761 1480.0706 1484.6306 1588.6557 1612.5044 1632.1928 2969.4541 2969.5317 2970.9698 2979.9099 2985.9016 2993.1788 3030.7821 3032.7802 3040.3431 3048.0047 3079.6835 3118.5145 3128.0845 3141.3606 3154.7804 3167.7061 3428.9037 3499.0924
redmass: 6.3226 4.0802 6.7844 3.7137 3.8238 4.2818 2.7691 4.4381 3.7495 4.7526 2.4612 3.6858 6.6802 1.9682 2.8225 3.3386 3.1339 2.7202 3.4810 2.2275 2.0429 2.7815 1.2234 3.9318 5.3420 3.4967 1.4773 1.7108 3.0075 2.2071 2.0501 2.1447 1.3069 2.3437 2.2186 2.8519 1.8819 1.5881 2.3678 2.0932 1.4240 2.1360 2.5470 1.8585 2.4428 2.2020 1.7478 1.9285 1.7765 1.5770 2.3732 2.0022 1.8225 1.0553 1.4587 1.1375 2.2771 1.3912 1.3370 1.3509 1.3380 1.3756 1.5948 1.3366 1.3741 1.4763 1.4763 2.0119 1.4494 3.7273 1.8590 1.1195 2.1181 1.0888 1.0895 1.0855 1.0996 2.1908 5.9013 6.0157 7.3379 1.0647 1.0709 1.0614 1.0735 1.0623 1.0646 1.0961 1.0976 1.1017 1.1025 1.0939 1.0842 1.0879 1.0931 1.0970 1.0986 1.0657 1.0637
irintensity: 0.4351 0.2272 0.1624 0.9971 1.1244 2.8306 0.4890 0.0430 1.3721 1.9854 1.5217 3.8410 4.3407 0.1600 0.2584 2.9039 1.1799 1.9038 5.4098 62.0021 13.0449 56.2232 101.4174 9.4927 0.8716 15.8240 132.8838 58.0183 11.5136 38.8393 5.6988 2.7638 2.8059 10.3275 7.4217 7.3483 9.2209 4.4415 9.3702 4.5796 0.6961 7.5059 0.4735 0.8315 27.5359 29.0376 7.5475 223.9142 56.8395 12.8665 17.9396 9.2828 1.9749 0.0886 19.9451 1.3434 1.0991 10.6384 1.5934 16.9671 3.3927 3.0635 4.2493 3.3221 3.9408 4.2628 2.6657 90.5809 8.7416 16.8368 53.2574 32.8401 8.0044 7.4485 7.4925 27.2498 1.8120 20.6887 1.5742 6.6100 166.2995 28.1129 9.4911 32.2473 23.9756 27.6946 15.1526 62.4797 52.9753 8.0349 83.6582 7.5637 2.0404 5.7615 39.9164 31.9395 9.5794 89.4224 23.5155
temp: 298.150 k
press: 1.00000 atm
elementType: 8 8 8 6 6 6 6 6 6 6 6 6 6 6 6 6 6 1 1 1 1 1 1 1 1 1 1 1 1 1 1 1 1 1 1
symmnumber: 1
zpe: 766319.9 jmol-1
zpe.correction: 0.291876 hartree
zpe.thermalcorrener: 0.307438 hartree
zpe.thermalcorrenthalpy: 0.308382 hartree
zpe.thermalcorrgfe: 0.248605 hartree
zpe.sumelectzpe: -768.695742 hartree
zpe.sumelectthermal: -768.680179 hartree
zpe.sumelectthermalent: -768.679235 hartree
zpe.sumelectthermalfe: -768.739013 hartree
dipole: -1.4640 0.4689 -2.1801
dipole: 2.6676
quadrupole: -94.9813 -97.8619 -102.0436
quadrupole: -1.0956 2.6099 3.6693
quadrupole: 3.3143 0.4337 -3.7480 -1.0956 2.6099 3.6693
hfenergy: -768.9876176 hartree
pointgroup: C01[X(C14H18O3)]
dipole: -0.5972854 -0.2206886 0.8342799 debye
polarizability: 179.9148742|17.1427887|134.3072302|3.1016048|-4.5602967|145.0853018 unknown
InChI: InChI=1S/C14H18O3/c15-13(16)10-14(17)9-5-4-8-12(14)11-6-2-1-3-7-11/h1-3,6-7,12,15,17H,4-5,8-10H2
charge 0 multiplicity 1
35 atoms
O  -0.577828 0.630596 -1.826332
O  -2.876152 2.140783 1.549457
O  -2.547647 2.327641 -0.731258
C  -0.958387 -0.186645 -0.656823
C  0.243032 -1.172216 -0.425301
C  -2.240094 -0.989655 -1.015405
C  -0.127009 -2.281087 0.598157
C  -2.595163 -2.095597 0.004005
C  -1.39905 -3.055948 0.188735
C  -1.162062 0.745382 0.576337
C  1.556776 -0.452055 -0.102696
C  2.300833 0.149013 -1.153675
C  2.070313 -0.354225 1.217859
C  -2.23381 1.78832 0.362735
C  3.514437 0.822087 -0.895588
C  3.286244 0.318776 1.481016
C  4.014611 0.910601 0.425124
H  0.36918 -1.662117 -1.413342
H  -2.051844 -1.4523 -2.004053
H  -3.089001 -0.291825 -1.153567
H  -0.290577 -1.844429 1.604363
H  0.730035 -2.974068 0.696057
H  -3.485586 -2.650418 -0.348342
H  -2.870238 -1.649222 0.981787
H  -1.633806 -3.824509 0.950152
H  -1.213122 -3.592044 -0.764591
H  -1.393179 0.179517 1.493384
H  -0.208951 1.281727 0.757487
H  -1.257045 1.357304 -1.91348
H  1.904511 0.100229 -2.172489
H  1.531353 -0.814782 2.053433
H  4.069294 1.278255 -1.723578
H  3.663973 0.377103 2.508512
H  4.958415 1.430133 0.626574
H  -3.543154 2.858275 1.364744
