program: Gaussian 09
title: 000263378
version: EM64L-G09RevD.01
frameworkgroup: C1[X(C14H18O)]
method: RPBEPBE
basis: SDD
operation: Freq
keyword: #pfreq=noraman
keyword: PBEPBE/SDD
title: #p freq=noraman PBEPBE/SDD
converged: NO YES NO NO
title: Mulliken charges:
elementType: O C C C C C C C C C C C C C C H H H H H H H H H H H H H H H H H H
charge: -0.206982 0.221211 -0.466826 -0.636393 -0.424797 -0.117791 0.175005 0.457271 -0.734894 -0.725590 -0.410733 -0.398650 -0.256002 -0.260759 -0.243803 0.191586 0.213948 0.250501 0.228713 0.229169 0.204978 0.211804 0.206681 0.220905 0.228415 0.235806 0.224691 0.205388 0.273334 0.223674 0.228002 0.223581 0.228557
chargesum: 0.00000
title: Mulliken charges with hydrogens summed into heavy atoms:
elementType: O C C C C C C C C C C C C C C
charge: -0.206982 0.221211 -0.061292 -0.157179 0.009350 0.094013 0.175005 0.457271 -0.078893 -0.059705 -0.137399 -0.174975 -0.028000 -0.037178 -0.015246
polarizability: 1.59295701e+02 -8.88918472e+00 1.48214178e+02 1.11925142e+01 1.03471730e+01 1.21420712e+02
1716.lowfreq: -21.7740 -13.5084 0.0005 0.0007 0.0009 2.2252 45.1419 51.8711 89.0764
frequency: 44.7562 51.8431 89.0510 119.4304 170.1188 207.4026 210.0597 225.9748 255.8986 275.6766 292.1770 302.0419 328.2530 386.9666 399.2728 407.9714 462.4530 495.9282 510.5669 550.2103 606.7834 616.9425 633.1874 703.4280 709.1603 726.7424 772.0161 826.9218 843.5121 855.2794 887.7091 923.9514 932.0301 938.8867 950.3440 978.5982 989.6926 997.0353 1011.7206 1028.9616 1034.6755 1062.8083 1080.2683 1087.7953 1103.6594 1116.4293 1133.0378 1157.9431 1174.0019 1179.5101 1202.2787 1210.2383 1235.0344 1264.7211 1283.8570 1296.3707 1308.5707 1328.5170 1332.2848 1348.4990 1374.6006 1387.1510 1392.6744 1433.1333 1450.6522 1463.0217 1464.9066 1469.3297 1472.4223 1475.2898 1477.5530 1488.0806 1588.1098 1611.3394 1620.6488 2927.4365 2967.9896 2971.9258 2975.6256 2986.5463 2990.5830 3038.4542 3046.5137 3062.2731 3069.0461 3081.4358 3084.1700 3097.2584 3115.6899 3127.3036 3139.4426 3155.6939 3167.7697
redmass: 3.5834 4.4130 6.9907 3.0269 1.0836 1.2082 2.5546 2.7165 2.7288 2.9355 2.7384 3.0174 2.6637 2.7417 3.3885 2.9268 3.4480 3.4296 2.4253 3.1749 3.5131 5.8973 3.7738 3.0524 1.8187 2.5107 1.9467 2.2720 2.0521 1.2541 1.9100 1.4035 1.8562 1.3749 1.5308 1.4148 4.8616 1.3589 1.9756 2.3561 1.8351 1.8187 1.5515 1.6786 2.5064 2.6059 2.1631 1.7527 1.0694 1.9287 1.3390 1.7268 1.5124 1.3870 1.4497 1.7731 1.6120 1.4048 1.4137 1.7309 5.7696 1.2089 1.2101 2.1933 1.1038 1.0917 1.0522 1.0592 1.0619 1.0998 1.0701 1.9175 5.7343 5.9099 9.3987 1.0803 1.0630 1.0538 1.0474 1.0585 1.0383 1.0959 1.1033 1.0962 1.0986 1.0990 1.1000 1.0991 1.0853 1.0871 1.0934 1.0960 1.0986
irintensity: 0.0625 1.6417 3.5911 0.4532 0.1939 0.1747 0.1537 0.9064 0.1852 4.8964 0.3134 0.4085 1.5284 0.3618 3.9676 0.7757 0.7992 0.4055 0.6174 17.3162 0.0808 0.1526 1.1788 12.6533 52.2533 2.2108 40.9578 2.4146 0.5661 0.2889 5.6305 2.4089 3.8542 5.9470 3.5875 0.5517 0.1377 0.0531 18.9689 5.0507 2.1859 12.1661 3.2533 14.7286 2.8763 5.2780 11.5257 1.3771 0.3325 10.7204 14.9740 14.4503 4.1051 1.2163 10.1575 9.9269 21.9929 2.7181 6.3668 2.7107 2.2054 10.4971 21.1110 8.9152 12.8207 12.2245 11.1997 17.0904 8.1536 6.6666 11.7494 22.2564 2.1268 7.0842 116.9041 14.3114 16.4047 8.0334 70.8384 16.5292 42.0856 30.6908 37.7286 5.5759 60.5746 25.3811 34.0304 25.0626 7.7357 2.0456 33.5824 25.1986 11.9857
temp: 298.150 k
press: 1.00000 atm
elementType: 8 6 6 6 6 6 6 6 6 6 6 6 6 6 6 1 1 1 1 1 1 1 1 1 1 1 1 1 1 1 1 1 1
symmnumber: 1
zpe: 740689.0 jmol-1
zpe.correction: 0.282114 hartree
zpe.thermalcorrener: 0.296223 hartree
zpe.thermalcorrenthalpy: 0.297167 hartree
zpe.thermalcorrgfe: 0.241682 hartree
zpe.sumelectzpe: -618.394869 hartree
zpe.sumelectthermal: -618.380760 hartree
zpe.sumelectthermalent: -618.379816 hartree
zpe.sumelectthermalfe: -618.435301 hartree
dipole: 0.4662 2.8295 1.7330
dipole: 3.3506
quadrupole: -88.2143 -90.1853 -92.0021
quadrupole: -7.6983 -1.4416 -1.9116
quadrupole: 1.9196 -0.0514 -1.8682 -7.6983 -1.4416 -1.9116
hfenergy: -618.676983 hartree
pointgroup: C01 [X(C14H18O1)]
dipole: -0.1621618 1.1481677 -0.6270071 debye
polarizability: 160.1648901|7.8876672|148.639247|10.6029167|-9.5447168|120.1264549 unknown
InChI: InChI=1S/C14H18O/c1-11-8-9-14(2,10-13(11)15)12-6-4-3-5-7-12/h3-7,11H,8-10H2,1-2H3
charge 0 multiplicity 1
33 atoms
O  2.138938 -1.604235 1.321084
C  0.125319 1.288451 0.430148
C  0.835227 1.649379 -0.915561
C  1.202676 0.6492 1.366062
C  1.516134 0.42945 -1.571066
C  2.597963 -0.211706 -0.648431
C  1.989392 -0.49962 0.730156
C  -1.073941 0.343312 0.169258
C  -0.392682 2.586998 1.113915
C  3.259294 -1.45146 -1.274121
C  -1.19983 -0.936384 0.769943
C  -2.11943 0.772834 -0.694975
C  -2.326893 -1.75392 0.51639
C  -3.242996 -0.039868 -0.952516
C  -3.35369 -1.313031 -0.345409
H  1.594974 2.432314 -0.710205
H  0.105677 2.092735 -1.618692
H  0.766498 0.303638 2.319685
H  1.933286 1.448838 1.610174
H  0.754555 -0.335289 -1.819743
H  1.996012 0.728136 -2.52258
H  3.373148 0.571001 -0.477141
H  0.440398 3.294282 1.288232
H  -1.147242 3.098185 0.489873
H  -0.863017 2.357891 2.087467
H  4.024543 -1.877021 -0.603253
H  2.509402 -2.24163 -1.456746
H  3.73494 -1.19186 -2.237468
H  -0.421442 -1.317569 1.437167
H  -2.060251 1.756913 -1.1755
H  -2.395105 -2.738359 0.993227
H  -4.031743 0.318712 -1.623871
H  -4.224914 -1.947716 -0.542104
