program: Gaussian 09
title: 000263369
version: EM64L-G09RevD.01
frameworkgroup: C1[X(C13H17BrO2)]
method: RPBEPBE
basis: SDD
operation: Freq
keyword: #p
keyword: freq=noraman
keyword: PBEPBE/SDD
title: #p freq=noraman PBEPBE/SDD
converged: NO YES NO NO
title: Mulliken charges:
elementType: Br O O C C C C C C C C C C C C C H H H H H H H H H H H H H H H H H
charge: -0.003477 -0.450421 -0.283264 -0.188169 -0.121185 -0.455679 -0.426362 -0.399870 -0.392166 0.335241 0.209574 -0.370164 -0.357835 -0.234595 -0.200436 -0.541624 0.207891 0.223520 0.208208 0.233092 0.218465 0.207318 0.193612 0.200460 0.194020 0.201778 0.338366 0.263698 0.243773 0.248789 0.225232 0.225083 0.247127
chargesum: 0.00000
title: Mulliken charges with hydrogens summed into heavy atoms:
elementType: Br O O C C C C C C C C C C C C C
charge: -0.003477 -0.112055 -0.283264 0.019722 0.102335 -0.014380 -0.000579 -0.005797 0.003631 0.335241 0.209574 -0.106466 -0.114062 -0.234595 0.048353 0.155818
polarizability: 2.20446639e+02 -1.07873606e+01 1.62572881e+02 3.59546225e+00 2.91476483e+00 1.04771231e+02
1716.lowfreq: -15.6015 -2.3705 -0.0002 0.0001 0.0005 10.8882 35.0211 58.8790 72.7656
frequency: 34.9338 58.4611 72.6927 86.0978 120.9953 137.2422 149.2876 191.0999 207.6983 229.3515 249.4241 274.1116 305.8088 315.5331 328.4470 347.6248 371.9990 387.2202 412.4329 449.3536 483.0415 515.7541 533.4217 575.7050 597.9058 640.1504 727.7526 731.9291 781.4432 804.8084 830.7101 839.2325 870.4815 891.4468 898.9852 930.6006 946.6987 953.3230 981.1321 1011.8188 1037.9674 1053.3450 1078.9386 1097.0191 1106.1262 1111.5444 1116.4190 1129.9419 1151.3744 1188.3221 1196.5758 1222.8756 1225.0576 1232.5284 1256.4182 1264.4251 1284.2914 1301.2379 1317.8027 1322.3495 1337.8822 1342.9980 1351.7082 1369.4799 1387.0218 1399.0571 1435.6934 1463.8360 1465.5937 1466.7046 1468.5810 1471.4289 1477.9934 1480.4500 1574.1409 1588.1383 2963.1469 2965.8770 2967.6848 2971.1365 2981.8024 2990.7033 2992.7505 3030.2723 3036.8713 3053.1573 3054.6864 3060.1832 3127.0074 3155.4536 3157.3720 3177.3183 3538.9779
redmass: 5.2001 3.9674 3.5280 3.9779 4.5857 5.1723 3.8922 2.6116 3.7311 3.6722 1.4253 5.2528 2.3559 2.1106 1.3065 3.1717 2.9728 3.4848 3.8314 3.0574 3.1832 3.7871 2.2853 4.2527 6.6255 5.3378 3.9334 3.7312 2.0420 1.4879 2.8047 1.8799 1.9866 1.4992 1.7159 1.3677 2.2855 2.6955 8.7863 3.4174 1.7198 1.6423 2.2511 1.3640 2.4605 1.2742 1.8925 1.9617 1.5328 1.5786 1.7351 2.2125 1.6701 1.3302 1.2915 1.2861 1.2889 1.2811 1.2829 1.3500 1.4306 1.4313 1.5380 5.1791 1.8000 2.4191 1.2002 1.0905 1.6247 1.0955 1.0555 1.0852 1.1320 1.2418 7.2955 7.0058 1.0332 1.0799 1.0632 1.0634 1.0736 1.0715 1.0646 1.0967 1.0993 1.1042 1.1020 1.1015 1.0997 1.0917 1.0878 1.0967 1.0656
irintensity: 0.4196 0.4799 1.3464 0.5245 1.7183 2.7802 0.2977 2.2620 3.3861 1.3919 1.4410 0.6974 4.7843 4.6173 91.4246 26.6159 0.3762 11.7536 2.6551 2.6620 6.1919 6.2764 7.6486 1.5239 40.2880 3.0098 0.2324 0.6478 0.3231 48.5946 16.0884 17.5566 9.5890 7.2875 15.0389 0.4189 10.7788 11.6558 37.0035 64.0621 1.2525 2.4111 15.1680 26.7778 4.9509 0.5222 18.0413 57.2911 16.3368 25.7005 24.1318 74.9742 27.9397 20.5410 19.6160 7.4904 0.5155 0.6917 2.6097 9.6892 0.1249 1.0322 5.7173 12.1989 9.5163 6.7230 13.1644 6.1928 181.8268 1.9653 14.0697 13.3898 11.2961 5.2603 2.1033 4.3571 71.2394 0.9162 36.4749 34.9168 13.3225 33.1808 39.6001 59.9920 64.0819 37.8612 18.5130 73.5526 18.7410 3.6319 3.8199 6.6186 1.0058
temp: 298.150 k
press: 1.00000 atm
elementType: 35 8 8 6 6 6 6 6 6 6 6 6 6 6 6 6 1 1 1 1 1 1 1 1 1 1 1 1 1 1 1 1 1
symmnumber: 1
zpe: 713427.9 jmol-1
zpe.correction: 0.271730 hartree
zpe.thermalcorrener: 0.287658 hartree
zpe.thermalcorrenthalpy: 0.288602 hartree
zpe.thermalcorrgfe: 0.227591 hartree
zpe.sumelectzpe: -668.259635 hartree
zpe.sumelectthermal: -668.243707 hartree
zpe.sumelectthermalent: -668.242763 hartree
zpe.sumelectthermalfe: -668.303774 hartree
dipole: -1.3872 4.1678 -1.3743
dipole: 4.6025
quadrupole: -108.3154 -90.1151 -112.7773
quadrupole: -1.0985 5.1487 5.5007
quadrupole: -4.5794 13.6208 -9.0414 -1.0985 5.1487 5.5007
hfenergy: -668.5313655 hartree
pointgroup: C01 [X(C13H17Br1O2)]
dipole: 0.0753147 -1.7502376 -0.4581687 debye
polarizability: 210.3460915|-24.6379839|172.3959096|-2.2486537|-5.1967648|105.0487495 unknown
InChI: InChI=1S/C13H17BrO2/c1-16-13-7-6-9(14)8-11(13)10-4-2-3-5-12(10)15/h6-8,10,12,15H,2-5H2,1H3
charge 0 multiplicity 1
33 atoms
Br -4.216227 2.359162 -0.247578
O  1.196436 1.061422 2.186969
O  0.066029 -2.082863 0.097783
C  0.958502 0.647475 -0.271355
C  1.771415 0.353596 1.026335
C  1.665458 0.021928 -1.510761
C  3.217785 0.852656 0.897338
C  3.124048 0.521408 -1.628796
C  3.921146 0.234997 -0.333835
C  -0.510744 0.244402 -0.154712
C  -0.946384 -1.108852 0.016245
C  -1.508466 1.247397 -0.221518
C  -2.323444 -1.425356 0.100279
C  -2.878414 0.922626 -0.138178
C  -3.300853 -0.407409 0.020829
C  -0.337458 -3.481398 0.271428
H  0.982107 1.750824 -0.396038
H  1.764221 -0.741344 1.206364
H  1.093061 0.280287 -2.422407
H  1.653706 -1.079913 -1.420816
H  3.762127 0.61204 1.829266
H  3.197489 1.957311 0.809471
H  3.127963 1.613869 -1.824029
H  3.614527 0.038328 -2.496069
H  4.014722 -0.862277 -0.197699
H  4.94947 0.635432 -0.418099
H  0.244392 0.797211 2.276591
H  -1.198915 2.289938 -0.344209
H  -2.655873 -2.459376 0.226821
H  -4.3634 -0.657435 0.08432
H  -0.949655 -3.832337 -0.581626
H  -0.896373 -3.625112 1.216227
H  0.604798 -4.047336 0.309161
