program: Gaussian 09
title: 000263361
version: EM64L-G09RevD.01
frameworkgroup: C1[X(C8H8O6)]
method: RPBEPBE
basis: SDD
operation: Freq
keyword: #p
keyword: freq=noraman
keyword: PBEPBE/SDD
title: #p freq=noraman PBEPBE/SDD
converged: YES YES NO NO
title: Mulliken charges:
elementType: O O O O O O C C C C C C C C H H H H H H H H
charge: -0.160908 -0.160917 -0.388847 -0.388843 -0.223696 -0.223691 -0.305072 -0.305172 -0.500067 -0.500095 0.187453 0.187478 0.160744 0.160803 0.311720 0.311722 0.253468 0.278164 0.253483 0.278156 0.387060 0.387054
chargesum: 0.00000
title: Mulliken charges with hydrogens summed into heavy atoms:
elementType: O O O O O O C C C C C C C C
charge: -0.160908 -0.160917 -0.001787 -0.001789 -0.223696 -0.223691 0.006649 0.006550 0.031565 0.031545 0.187453 0.187478 0.160744 0.160803
polarizability: 1.05061479e+02 5.32725918e+00 1.03057515e+02 -3.62203903e-03 -2.77368232e-03 8.95053453e+01
1716.lowfreq: -6.1849 -0.0009 -0.0005 -0.0004 4.1755 8.6274 38.5983 43.3061 61.3982
frequency: 38.4873 43.3038 61.3961 72.5209 120.0918 127.4923 161.1901 190.8232 240.2763 313.7546 315.4163 386.9951 422.3174 424.7180 470.1293 511.1852 549.5899 563.3069 598.5464 625.5673 628.9197 672.6267 678.5629 718.7388 762.1062 801.1613 874.9732 911.1446 923.0571 956.3119 1015.0840 1041.2511 1057.7509 1074.1454 1135.8993 1140.7465 1153.8257 1208.8877 1218.5882 1247.4306 1268.3335 1285.0134 1303.7191 1332.3433 1335.5841 1342.1579 1434.4979 1436.3796 1628.1345 1628.6379 1650.7644 1657.7625 3001.3277 3003.4416 3069.3072 3069.5257 3073.8079 3074.8378 3507.4075 3507.4775
redmass: 9.1785 9.7378 10.0342 7.7311 8.1408 6.6563 5.7780 2.2460 10.2608 8.4532 6.4633 9.3687 2.7855 6.0222 4.2719 3.2162 3.3231 2.7808 1.7166 4.1865 1.9013 2.6130 2.9092 3.5304 4.6526 3.0822 5.2976 3.3868 3.6923 2.0397 2.5482 3.1364 2.2093 1.8929 4.1153 3.0225 1.2908 1.3694 1.3451 1.4743 1.6783 1.4244 1.4433 1.5381 1.8485 2.1260 1.0781 1.0740 8.8255 9.6633 10.1606 9.8789 1.0664 1.0601 1.0846 1.0940 1.0868 1.0993 1.0641 1.0641
irintensity: 4.0868 2.5430 0.0181 3.8245 0.0034 9.8308 0.4972 4.2064 0.8794 0.1633 2.2107 1.5774 9.0028 13.5675 2.5751 6.6750 73.9965 72.8663 155.4432 8.8489 53.6321 74.0900 10.2874 12.1707 2.2069 7.5801 0.5671 21.7331 1.1924 93.6249 83.0038 98.2531 375.5022 140.2684 22.5169 108.6071 2.2118 0.0177 5.1569 11.3713 11.6814 35.6135 13.7242 27.4850 65.3628 33.9150 41.8995 19.2607 36.8030 649.7619 59.4538 29.2545 0.2997 8.8701 0.5776 8.1659 1.1278 3.3286 72.0276 12.4723
temp: 298.150 k
press: 1.00000 atm
elementType: 8 8 8 8 8 8 6 6 6 6 6 6 6 6 1 1 1 1 1 1 1 1
symmnumber: 1
zpe: 407141.7 jmol-1
zpe.correction: 0.155072 hartree
zpe.thermalcorrener: 0.168323 hartree
zpe.thermalcorrenthalpy: 0.169267 hartree
zpe.thermalcorrgfe: 0.113851 hartree
zpe.sumelectzpe: -759.951710 hartree
zpe.sumelectthermal: -759.938458 hartree
zpe.sumelectthermalent: -759.937514 hartree
zpe.sumelectthermalfe: -759.992931 hartree
dipole: 0.0001 -0.0005 -0.5728
dipole: 0.5728
quadrupole: -71.7346 -100.3299 -70.6590
quadrupole: -13.0104 0.0007 0.0074
quadrupole: 9.1733 -19.4221 10.2488 -13.0104 0.0007 0.0074
hfenergy: -760.1067818 hartree
pointgroup: C01 [X(C8H8O6)]
dipole: -0.0000434 -0.2253511 0.0001981 debye
dipolederiv: -0.5531504 0.0581202 0.3921498 -0.0353554 -0.4815209 -0.0500486 0.2819207 -0.0941823 -0.6925226 -0.5531518 -0.0580107 0.3919898 0.0354924 -0.4814668 0.0498088 0.2821289 0.0940798 -0.6925182 -0.96998 -0.4996331 0.1687316 -0.4286132 -0.6725747 0.0705409 0.1945507 0.080305 -0.2748613 -0.969278 0.4999613 0.1684467 0.4290328 -0.6734117 -0.0704724 0.1943185 -0.0802387 -0.2747778 -0.631123 -0.1481046 -0.1631926 -0.2125583 -0.4261078 0.1865415 0.0640786 0.1593627 -0.8924622 -0.6310169 0.1482373 -0.1633343 0.2128126 -0.4265783 -0.1866096 0.0639553 -0.1596685 -0.892234 -0.0679886 -0.1496598 -0.1614264 -0.1161613 -0.3198885 -0.3546451 -0.2054781 -0.3210521 -0.4078858 -0.0679526 0.1493761 -0.1611688 0.1159354 -0.3199166 0.3547339 -0.2051323 0.3209981 -0.4078281 -0.0646692 -0.1611681 0.1104595 -0.1866629 -0.279503 0.0308254 0.0073276 -0.0309169 0.0223865 -0.0647259 0.161228 0.1104761 0.1865726 -0.2795603 -0.0307316 0.0072049 0.0310634 0.0224017 0.5633677 -0.0073318 -0.5831895 0.2327953 1.0292695 0.34075 -0.3263585 0.2863398 0.7693937 0.5632388 0.007428 -0.5833735 -0.2326325 1.0291548 -0.3405977 -0.3266895 -0.2863056 0.7692475 1.2946644 0.7944801 0.2941774 0.6587936 0.6158299 -0.3158783 0.0250477 -0.2068273 1.1704842 1.2935677 -0.7949066 0.2946489 -0.6594938 0.6173103 0.3158405 0.0252706 0.2070442 1.1701823 0.0541886 -0.0065635 0.0327204 0.0096114 0.0375125 0.0361946 0.0306869 0.0465543 0.0575064 0.054194 0.0065295 0.0326975 -0.0096113 0.037483 -0.0361653 0.0306839 -0.0465437 0.057499 0.0260612 0.0994725 0.0490169 0.0618281 -0.0256609 -0.033859 0.0678916 -0.0059881 0.0653973 0.0283061 -0.0275933 -0.0592513 -0.021824 0.1404633 0.0462562 -0.0205836 0.0246307 0.0190299 0.0260787 -0.0994561 0.0490381 -0.0618236 -0.0256072 0.0338896 0.0679339 0.00606 0.0653951 0.0283574 0.0275692 -0.0592332 0.0218707 0.1404197 -0.0463325 -0.020529 -0.0246978 0.0190843 0.3205146 0.0130986 -0.0801652 0.0279614 0.3821862 0.0628237 -0.1191039 0.0425383 0.1635238 0.3204972 -0.013073 -0.0802179 -0.0279704 0.3821675 -0.062865 -0.1191249 -0.0425554 0.1635583 unknown
polarizability: 105.7137332|-0.0073744|89.5053476|-5.1620877|0.002719|102.4052587 unknown
InChI: InChI=1S/C8H8O6/c9-3-1-2-4(10)6(8(13)14)5(3)7(11)12/h5-6,11,13H,1-2H2
charge 0 multiplicity 1
22 atoms
O  -1.850573 0.638865 2.062312
O  1.851617 0.637688 -2.061116
O  -2.8431 -1.551049 -0.314793
O  2.842696 -1.552942 0.316825
O  -1.723708 -0.289765 -1.912885
O  1.724155 -0.289934 1.914186
C  -0.706065 -0.645454 0.317531
C  0.706491 -0.645823 -0.316133
C  -0.245958 1.913833 0.732278
C  0.247537 1.913587 -0.731291
C  -1.011847 0.657939 1.135494
C  1.013204 0.657422 -1.134005
C  -1.770775 -0.790738 -0.764879
C  1.770968 -0.791502 0.766434
H  -0.833364 -1.481993 1.02449
H  0.833409 -1.482489 -1.023016
H  -0.891484 2.786442 0.933965
H  0.611351 1.986588 1.430068
H  0.893167 2.786019 -0.933359
H  -0.609836 1.986163 -1.429012
H  -3.551405 -1.586874 -1.014595
H  3.550918 -1.588981 1.0167
