program: Gaussian 09
title: 000263355
version: EM64L-G09RevD.01
frameworkgroup: C1[X(C28H19NO2)]
method: RPBEPBE
basis: SDD
operation: Freq
keyword: #p
keyword: freq=noraman
keyword: PBEPBE/SDD
title: #p freq=noraman PBEPBE/SDD
converged: YES YES NO NO
title: Mulliken charges:
elementType: O O N C C C C C C C C C C C C C C C C C C C C C C C C C C C C H H H H H H H H H H H H H H H H H H H
charge: -0.403013 -0.198036 0.010206 -0.494572 0.419593 0.403125 0.048360 -0.203959 0.427003 0.132455 0.154233 -0.367347 -0.402008 0.407804 0.410633 -0.467114 -0.312259 -0.470962 0.147819 -0.493554 -0.334389 -0.367003 -0.269975 -0.477826 -0.167908 -0.460764 -0.446434 -0.286318 -0.291163 -0.253383 -0.253145 0.292284 0.290708 0.234251 0.265404 0.245234 0.232819 0.238501 0.239805 0.267804 0.267695 0.229204 0.242634 0.241124 0.241694 0.235842 0.240201 0.230930 0.233047 0.390719
chargesum: 0.00000
title: Mulliken charges with hydrogens summed into heavy atoms:
elementType: O O N C C C C C C C C C C C C C C C C C C C C C C C C C C C C
charge: -0.012294 -0.198036 0.010206 -0.202288 0.419593 0.403125 0.048360 0.086749 0.427003 0.132455 0.154233 -0.133096 -0.136604 0.407804 0.410633 -0.221880 -0.079439 -0.232461 0.147819 -0.253749 -0.066586 -0.099308 -0.040772 -0.235192 -0.167908 -0.219640 -0.204740 -0.050476 -0.050962 -0.022453 -0.020098
polarizability: 3.74277508e+02 4.16060569e+01 3.37329208e+02 8.81696336e+00 -6.30860066e+01 2.41264714e+02
1716.lowfreq: -9.7196 -4.9291 -0.0006 0.0005 0.0006 2.2847 29.3095 33.3678 35.1193
frequency: 29.2445 33.3205 35.1056 37.7698 50.9514 54.5334 81.3765 99.8592 125.1150 135.1706 144.1861 152.8785 177.7264 187.2457 194.2664 208.3701 229.0805 230.4241 272.9907 293.2098 323.3076 373.1663 393.5525 409.6112 420.4939 425.3668 440.9560 450.3382 473.4797 483.3853 498.4855 504.1031 509.3911 511.1693 535.9455 539.0982 562.7231 570.5287 603.2141 606.6150 615.2652 631.0776 645.6446 651.8420 686.9317 708.7884 712.2546 722.7974 750.3590 750.6749 767.6864 781.9844 784.1543 786.4463 801.2935 815.5814 821.8178 834.4731 854.7180 862.1009 878.5478 887.7040 895.7929 918.4081 926.1020 940.1541 960.7565 970.2893 975.2398 985.4809 988.4088 989.5345 990.4743 993.5379 995.8886 998.8603 1018.4303 1036.2860 1050.0762 1061.0115 1089.0893 1104.0958 1129.9724 1150.9421 1164.2448 1176.3410 1177.6030 1179.7049 1185.8525 1211.1707 1230.4119 1233.1040 1234.0496 1236.8541 1240.9764 1243.5615 1258.5618 1271.8012 1295.6534 1310.4249 1318.5690 1340.6504 1372.6876 1380.4691 1394.8731 1403.1681 1409.3118 1414.3600 1420.0791 1438.9199 1442.9660 1453.3926 1455.6044 1501.9622 1517.7103 1530.2955 1576.7894 1586.9055 1600.5308 1603.1186 1618.0686 1630.3520 1631.3182 1665.5481 2202.5274 3044.0717 3059.3079 3121.5507 3123.4192 3123.5274 3126.1938 3126.6366 3134.6745 3136.8971 3137.6874 3147.1964 3147.6287 3156.3422 3159.7155 3161.6457 3165.8270 3171.4960 3207.2849 3511.7301
redmass: 7.1414 6.9192 6.7534 5.2835 6.3118 6.8513 6.6309 5.4460 5.0875 6.4832 5.2441 6.3260 6.3359 4.3619 5.4712 5.9648 3.9441 5.1168 4.8402 4.6633 4.7565 7.9449 5.4032 4.2651 3.8038 3.7530 6.2047 4.9444 3.3047 4.1749 5.0596 5.7046 5.5189 4.6165 5.7089 4.4153 2.7339 3.4365 3.3497 4.9287 2.0779 4.4001 5.1585 3.2420 4.6331 4.9031 5.2284 3.9081 1.4037 1.4400 2.3711 1.4670 5.3443 2.2047 4.0361 1.7219 2.0429 3.7555 2.5645 3.4939 1.7858 1.5565 3.6717 1.5013 1.7894 3.0345 1.3692 1.4117 1.4140 2.4702 2.1937 1.9395 2.1121 1.4908 4.3544 1.3957 3.6148 2.3300 2.2117 2.2542 2.2589 2.1793 1.7686 1.4594 1.2925 1.1328 1.2183 1.2016 1.2229 1.4343 1.8531 1.7020 1.9734 1.9715 1.5827 1.7480 1.7867 1.6520 1.6633 2.1236 1.3280 1.8441 3.1981 2.0477 7.0714 3.4451 2.5375 2.4992 2.7635 2.4384 2.4316 2.2593 2.3002 3.4133 3.4965 4.4002 7.1216 7.4486 5.1419 5.4356 6.1333 6.9101 6.2225 8.7068 12.5697 1.0826 1.0835 1.0865 1.0864 1.0867 1.0863 1.0858 1.0910 1.0907 1.0897 1.0930 1.0984 1.0951 1.0988 1.0994 1.0965 1.0972 1.0915 1.0641
irintensity: 1.8546 0.6306 1.0171 0.1775 1.6181 0.2453 0.4193 1.5804 0.5406 0.4554 0.5699 1.4725 1.9407 1.2824 0.2868 3.4023 1.4392 1.5765 0.5890 1.6635 2.1558 1.5280 0.8345 3.0410 1.6491 1.7699 8.0060 22.9443 1.7640 3.4842 1.3417 3.8643 4.1053 4.5129 5.6220 2.2591 29.2080 4.2960 13.4126 10.3069 93.7368 25.1384 4.1301 20.1013 16.1310 9.9945 12.3961 18.3539 10.1262 71.1671 4.2801 3.2063 0.1745 52.8344 9.2298 76.2464 6.0735 9.6557 33.1347 9.0267 11.2688 12.1294 3.7874 8.0809 0.9849 2.5174 5.2129 1.6064 2.1385 0.7189 2.4263 3.3480 7.5268 7.1194 36.5344 0.4256 11.0393 5.8360 2.8020 179.6441 4.1237 7.2573 6.1964 0.9438 3.5446 1.2116 1.5924 1.5865 0.4719 5.9361 2.8148 8.8521 6.0003 3.1781 9.8926 1.0094 3.2837 2.2247 0.0250 21.1715 15.5704 57.1787 1.8071 13.7446 1.3296 3.6071 4.5175 3.2632 0.5563 7.0411 6.0692 10.0251 0.6891 2.2101 9.9983 1.0301 1.1835 1.4638 8.3978 2.7780 4.7781 0.2453 1.1128 134.1488 5.1776 1.0797 1.4468 1.4278 2.1738 1.5307 1.6418 2.4624 26.0072 17.2469 8.1267 27.4307 31.0184 36.4851 39.0105 15.8018 21.9569 7.7104 1.1007 33.1650
temp: 298.150 k
press: 1.00000 atm
elementType: 8 8 7 6 6 6 6 6 6 6 6 6 6 6 6 6 6 6 6 6 6 6 6 6 6 6 6 6 6 6 6 1 1 1 1 1 1 1 1 1 1 1 1 1 1 1 1 1 1 1
symmnumber: 1
zpe: 1009959.6 jmol-1
zpe.correction: 0.384673 hartree
zpe.thermalcorrener: 0.409142 hartree
zpe.thermalcorrenthalpy: 0.410086 hartree
zpe.thermalcorrgfe: 0.329732 hartree
zpe.sumelectzpe: -1281.503910 hartree
zpe.sumelectthermal: -1281.479442 hartree
zpe.sumelectthermalent: -1281.478497 hartree
zpe.sumelectthermalfe: -1281.558852 hartree
dipole: 2.5931 1.5579 3.8093
dipole: 4.8643
quadrupole: -149.9903 -169.3910 -189.0949
quadrupole: -2.6199 -4.3394 -17.4439
quadrupole: 19.5018 0.1010 -19.6028 -2.6199 -4.3394 -17.4439
hfenergy: -1281.8885838 hartree
pointgroup: C01 [X(C28H19N1O2)]
dipole: -0.8922614 0.8913995 -1.4393811 debye
polarizability: 369.6860946|-49.6157901|317.7219898|11.8235472|72.0128421|265.4633455 unknown
InChI: InChI=1S/C28H19NO2/c29-17-25(28(30)31)27(23-13-5-9-18-7-1-3-11-21(18)23)24-14-6-10-20-16-15-19-8-2-4-12-22(19)26(20)24/h1-16,25,27,30H
charge 0 multiplicity 1
50 atoms
O  -3.23109 -2.523578 0.622379
O  -2.247695 -1.642904 2.536327
N  0.940571 -3.494277 2.166642
C  -0.280405 -0.88914 0.033489
C  1.130118 -1.09749 -0.563326
C  -1.315605 -0.268041 -0.932705
C  2.247037 -0.215089 -0.282581
C  -0.837761 -2.281298 0.590461
C  3.575339 -0.699419 -0.609278
C  -2.36193 0.622639 -0.459205
C  2.154326 1.117824 0.341033
C  1.36413 -2.274682 -1.308146
C  -1.273645 -0.593269 -2.295368
C  3.353527 1.748462 0.851198
C  -3.343104 1.122297 -1.409701
C  3.7559 -1.90008 -1.356443
C  2.654168 -2.662663 -1.744331
C  4.750369 0.002169 -0.140988
C  -2.142683 -2.098462 1.381327
C  4.644826 1.146243 0.618021
C  0.947999 1.884109 0.408739
C  -2.476793 1.065362 0.904826
C  -2.239859 -0.101164 -3.222748
C  -3.263171 0.736791 -2.786755
C  0.150875 -2.947798 1.460256
C  3.275071 3.009423 1.517817
C  -4.383317 2.003748 -0.96339
C  0.89443 3.133674 1.044249
C  -3.497704 1.928628 1.308237
C  2.058814 3.691217 1.63884
C  -4.466838 2.401958 0.370756
H  -0.169188 -0.251215 0.926025
H  -1.069776 -2.939819 -0.263511
H  0.532098 -2.952203 -1.527155
H  -0.465509 -1.22551 -2.672889
H  4.774785 -2.221385 -1.601027
H  2.781119 -3.58143 -2.325568
H  5.731492 -0.423953 -0.380225
H  5.536874 1.645629 1.013188
H  0.053471 1.539407 -0.107851
H  -1.759497 0.729742 1.658611
H  -2.165485 -0.386057 -4.277562
H  -4.012532 1.119961 -3.489382
H  4.198629 3.449958 1.912124
H  -5.11314 2.364136 -1.698291
H  -0.051875 3.685339 1.062967
H  -3.555253 2.24291 2.35584
H  2.010377 4.659021 2.149242
H  -5.263877 3.076558 0.701372
H  -4.075314 -2.35138 1.122558
