program: Gaussian 09
title: 000263349
version: EM64L-G09RevD.01
frameworkgroup: C1[X(C23H15FN4O4)]
method: RPBEPBE
basis: SDD
operation: Freq
keyword: #p
keyword: freq=noraman
keyword: PBEPBE/SDD
title: #p freq=noraman PBEPBE/SDD
converged: YES YES NO NO
title: Mulliken charges:
elementType: F O O O O N N N N C C C C C C C C C C C C C C C C C C C C C C C H H H H H H H H H H H H H H H
charge: -0.194954 -0.187729 -0.258099 -0.212172 -0.206278 -0.051637 -0.423898 0.023346 0.015494 0.253306 0.171434 0.385943 -0.030842 -0.369106 0.260244 -0.359376 -0.458946 -0.436175 -0.256660 -0.260219 -0.245490 0.295318 -0.525618 -0.372671 0.259588 -0.287855 0.356140 -0.176080 -0.499521 0.448135 -0.377870 -0.379691 0.255264 0.274425 0.245877 0.241785 0.235971 0.233175 0.234641 0.292531 0.261828 0.388455 0.301514 0.240863 0.336176 0.293554 0.265880
chargesum: 0.00000
title: Mulliken charges with hydrogens summed into heavy atoms:
elementType: F O O O O N N N N C C C C C C C C C C C C C C C C C C C C C C C
charge: -0.194954 -0.187729 -0.258099 -0.212172 -0.206278 -0.051637 -0.035443 0.023346 0.015494 0.253306 0.171434 0.385943 -0.030842 -0.113842 0.260244 -0.084951 -0.213069 -0.194390 -0.020689 -0.027043 -0.010849 0.295318 -0.233087 -0.110842 0.259588 0.013659 0.356140 0.064783 -0.163345 0.448135 -0.084316 -0.113811
polarizability: 5.72319839e+02 -4.81446022e-01 4.12707459e+02 1.10024597e+01 4.63340212e+00 1.65210921e+02
1716.lowfreq: -2.2722 0.0005 0.0005 0.0007 3.2006 3.7841 15.3570 19.3603 29.0563
frequency: 15.3315 19.2606 29.0502 34.3279 38.9223 53.4486 58.0915 75.4014 81.1546 99.0092 142.4627 152.0542 162.7255 168.4599 177.5978 183.9415 197.1548 229.1734 240.9308 245.2395 299.4217 310.6147 353.4398 358.8606 379.0280 388.8168 405.9292 420.6726 430.0667 444.5564 448.0862 472.5202 491.0600 501.8152 507.2925 509.7656 515.9865 531.8642 543.7841 585.6722 618.2473 633.3312 638.3555 650.8190 654.6464 671.9551 682.2181 699.9760 705.7049 720.3125 724.6069 749.2980 753.2904 760.8976 785.0397 789.1492 803.5843 819.8632 829.6829 841.0779 862.6746 873.3613 883.3112 890.7756 908.4172 911.4073 931.4170 943.6157 964.3143 968.1998 982.7077 987.1786 990.9341 998.1129 1011.8404 1030.1038 1035.2386 1055.1025 1068.0255 1083.4140 1095.8296 1101.1528 1137.3446 1140.2066 1155.1841 1165.0999 1175.1550 1176.3658 1192.7391 1209.4140 1225.2548 1232.5435 1237.1261 1263.7565 1285.8040 1295.0498 1300.7811 1338.2609 1356.9275 1371.4735 1376.3585 1384.7532 1403.5301 1407.4307 1428.0421 1437.7068 1446.4327 1453.9037 1466.5154 1472.6046 1499.9345 1506.3095 1524.5414 1576.2719 1578.9341 1585.9207 1591.8160 1611.7063 1620.2755 1627.4194 3125.0728 3128.9339 3138.5801 3145.6213 3146.7178 3160.7916 3161.4824 3165.3482 3165.8557 3179.0649 3183.7055 3188.7383 3192.6641 3198.0274 3216.0497
redmass: 7.9493 6.9242 7.7491 6.7696 7.7776 5.2098 13.6850 11.7600 6.2327 7.4974 5.6498 10.1720 5.4080 8.7040 5.1820 5.2989 8.0819 5.4511 4.6088 5.0802 7.7387 8.9880 5.8677 9.7049 7.5757 6.8961 5.0315 3.7874 5.8342 3.6444 3.8633 3.2831 7.9641 8.2579 8.0168 5.6700 3.8873 4.1441 6.0735 4.9438 5.4141 5.7143 5.3481 7.8616 6.2259 9.1670 3.7421 3.3101 7.6234 4.8422 5.3198 1.4597 8.7965 4.0626 2.7821 2.6976 1.5970 1.6261 3.6390 1.4524 1.4977 3.7992 1.6673 5.0517 1.5460 1.3813 1.4195 5.0316 1.4069 1.3754 1.3398 6.2463 1.3684 1.3601 1.3125 2.6502 3.6964 2.2950 2.3317 1.6992 2.3382 3.7931 1.3538 1.8852 1.4577 5.6229 1.2038 1.1233 1.4637 5.3570 2.3076 2.0558 1.8466 1.8357 1.3517 2.1006 2.3944 4.4050 5.9226 3.7200 7.7894 5.1355 2.4382 6.6984 3.2281 2.4913 5.3927 2.4231 2.8420 2.7545 4.8725 4.0837 5.0595 6.1250 6.0597 6.3129 5.5629 6.9577 7.3424 6.4458 1.0870 1.0872 1.0907 1.0908 1.0877 1.0983 1.0929 1.0944 1.0984 1.0891 1.0981 1.0919 1.0937 1.0965 1.0789
irintensity: 0.2975 0.0176 0.5722 0.3301 0.3797 0.5375 0.0769 0.0670 2.5806 0.9597 1.3221 0.7539 2.1701 3.9980 0.9501 1.0996 5.3605 0.6441 1.5323 1.8937 1.6344 0.6949 7.5784 0.5463 0.0723 1.2152 7.6420 1.2851 18.2651 2.6441 1.5463 0.6707 1.9494 7.7274 1.8197 9.1309 6.1713 9.8729 0.4330 9.8070 3.0979 10.8141 10.5656 13.2551 4.7507 7.9600 1.9393 15.4519 6.3342 8.6034 8.8735 0.7844 18.8192 12.5777 36.4387 39.4853 25.3568 50.5586 18.2652 54.9351 20.8494 37.2008 12.3903 8.5272 20.7143 10.3091 1.6186 2.3417 23.2116 1.9683 0.4172 4.3610 1.3540 0.5152 0.2016 7.6288 27.8156 70.0885 11.5096 5.6480 8.0372 50.5261 55.0348 30.7190 8.6138 312.8195 23.1369 7.0974 13.8276 685.2504 62.5990 120.1674 9.1579 46.2354 5.6383 74.3705 37.3024 347.2591 63.3596 15.3579 2.4496 34.8333 2.2014 3.0424 48.2287 0.8239 2.7832 11.2106 16.3377 20.8275 29.6055 226.1789 15.3455 101.0683 81.4918 47.5401 9.5467 37.8172 464.4882 8.2722 1.2437 1.0776 14.6155 16.4792 4.2639 34.6544 2.3347 5.3495 28.4994 3.8841 4.3469 21.9705 5.8303 0.3792 87.6495
temp: 298.150 k
press: 1.00000 atm
elementType: 9 8 8 8 8 7 7 7 7 6 6 6 6 6 6 6 6 6 6 6 6 6 6 6 6 6 6 6 6 6 6 6 1 1 1 1 1 1 1 1 1 1 1 1 1 1 1
symmnumber: 1
zpe: 880258.5 jmol-1
zpe.correction: 0.335273 hartree
zpe.thermalcorrener: 0.361136 hartree
zpe.thermalcorrenthalpy: 0.362080 hartree
zpe.thermalcorrgfe: 0.276092 hartree
zpe.sumelectzpe: -1502.827006 hartree
zpe.sumelectthermal: -1502.801143 hartree
zpe.sumelectthermalent: -1502.800198 hartree
zpe.sumelectthermalfe: -1502.886187 hartree
dipole: -10.3845 -0.9603 0.8979
dipole: 10.4674
quadrupole: -211.7578 -184.0498 -181.8102
quadrupole: 4.9397 -1.0551 0.0454
quadrupole: -19.2185 8.4894 10.7291 4.9397 -1.0551 0.0454
hfenergy: -1503.162279 hartree
pointgroup: C01 [X(C23H15F1N4O4)]
dipole: -4.1166592 -0.0043199 -0.1126976 debye
polarizability: 568.2415493|9.5368922|409.5830258|-36.8324349|-33.0095691|172.4136447 unknown
InChI: InChI=1S/C23H15FN4O4/c24-17-8-3-7-16(13-17)23(20-10-4-6-15-5-1-2-9-19(15)20)26-25-21-12-11-18(27(29)30)14-22(21)28(31)32/h1-14,25H
charge 0 multiplicity 1
47 atoms
F  -0.121574 -4.792166 2.234422
O  4.531273 -2.351701 -0.882658
O  2.287539 -2.558081 -0.545069
O  5.610995 3.789968 -0.181981
O  6.786435 1.874746 -0.602502
N  -0.359275 0.239656 0.120223
N  0.831102 -0.445601 -0.071913
N  3.381992 -1.832868 -0.624678
N  5.686625 2.509855 -0.361738
C  -2.771362 0.255655 0.363866
C  -3.03288 1.579201 -0.191156
C  -4.331011 2.186426 0.057545
C  -1.481462 -0.471015 0.234919
C  -3.794871 -0.396074 1.086679
C  -1.496977 -1.976824 0.257304
C  -2.106137 2.30977 -1.008275
C  -5.318438 1.488682 0.8265
C  -4.627613 3.482903 -0.480287
C  -5.057098 0.212973 1.32603
C  -2.429865 3.565541 -1.531292
C  -3.695401 4.16852 -1.258544
C  2.013041 0.260514 -0.143343
C  -0.78258 -2.690031 1.256335
C  -2.218321 -2.696483 -0.732267
C  3.276478 -0.389516 -0.41004
C  2.027098 1.681993 0.052478
C  -0.812535 -4.093277 1.229942
C  -2.212471 -4.108872 -0.736078
C  4.476677 0.350501 -0.480806
C  4.435396 1.735671 -0.286951
C  3.210778 2.41023 -0.017527
C  -1.50543 -4.828799 0.253477
H  -3.604063 -1.391771 1.498987
H  -1.128352 1.873015 -1.214359
H  -6.285382 1.972189 1.008897
H  -5.610207 3.922769 -0.272252
H  -5.812534 -0.322983 1.909449
H  -1.703541 4.093981 -2.158658
H  -3.931117 5.156846 -1.66721
H  -0.234485 -2.174433 2.051151
H  -2.777385 -2.146644 -1.49599
H  0.902325 -1.476229 -0.204541
H  1.074149 2.169151 0.266881
H  -2.761391 -4.654221 -1.510235
H  5.420787 -0.160576 -0.685675
H  3.224607 3.492728 0.133112
H  -1.487143 -5.922026 0.273521
