program: Gaussian 09
title: 000263335
version: EM64L-G09RevD.01
frameworkgroup: C1[X(C20H15NO)]
method: RPBEPBE
basis: SDD
operation: Freq
keyword: #p
keyword: freq=noraman
keyword: PBEPBE/SDD
title: #p freq=noraman PBEPBE/SDD
converged: YES YES NO NO
title: Mulliken charges:
elementType: O N C C C C C C C C C C C C C C C C C C C C H H H H H H H H H H H H H H H
charge: -0.252850 -0.441463 0.039030 0.255994 0.530074 0.214134 0.163497 0.286845 0.398766 -0.698048 -0.491678 -0.488432 -0.420819 -0.362477 -0.404321 -0.441944 -0.267960 -0.282389 -0.260111 -0.255335 0.213612 -0.803483 0.317725 0.254609 0.239070 0.280472 0.190460 0.270380 0.240573 0.309994 0.233041 0.230900 0.227654 0.229751 0.237583 0.270067 0.237081
chargesum: 0.00000
title: Mulliken charges with hydrogens summed into heavy atoms:
elementType: O N C C C C C C C C C C C C C C C C C C C C
charge: -0.252850 -0.131469 0.039030 0.255994 0.530074 0.214134 0.163497 0.286845 0.398766 -0.380323 -0.237069 -0.249362 -0.140347 -0.172017 -0.133941 -0.201371 -0.034919 -0.051489 -0.032457 -0.025584 0.213612 -0.058752
polarizability: 3.88253232e+02 -1.43573207e+01 2.80320044e+02 3.45925861e+00 1.11468182e+01 9.99202334e+01
1716.lowfreq: -76.3934 -3.3628 0.0001 0.0002 0.0007 1.5861 4.5968 38.3073 46.0595
frequency: -76.3924 38.3066 46.0387 75.4163 93.0810 108.2529 128.0982 175.5933 180.6459 215.5051 243.7162 277.8847 282.0717 321.3081 376.9875 389.1526 408.5238 438.9728 451.0488 481.7119 507.8394 527.9877 530.0838 539.6997 571.5646 577.3558 581.0272 609.7663 620.7371 648.1383 671.5581 679.4448 685.9869 744.0458 750.2106 760.3554 781.1308 799.0775 806.2486 829.2890 837.6027 858.3286 884.8011 920.7761 937.8806 942.1553 945.8053 963.9339 974.4682 980.2797 988.2440 999.2129 1015.5702 1030.6922 1038.1947 1066.6266 1075.0308 1116.0679 1138.6779 1166.6330 1175.4706 1187.9841 1207.0116 1227.7670 1233.9872 1237.8120 1266.6522 1288.0722 1311.7867 1363.7005 1371.6434 1375.8562 1394.1583 1395.0787 1417.3024 1424.7272 1439.6972 1442.1819 1451.6915 1468.9076 1472.5515 1504.3352 1521.0066 1536.4698 1567.8447 1608.0183 1610.4968 1613.6478 1630.9014 1638.3223 2987.2502 3072.0824 3110.9518 3120.9561 3124.7239 3133.0964 3136.3698 3136.6030 3149.0875 3155.2914 3158.6276 3170.5462 3179.5894 3183.5624 3550.5326
redmass: 1.0616 4.1830 6.3130 4.0702 4.1350 4.7931 4.2056 4.3681 4.2972 4.3027 5.8917 4.5880 5.3325 4.7099 4.8307 4.9342 3.2398 4.0222 4.1839 3.6829 6.1916 5.3105 3.9327 4.5402 3.1165 3.1355 3.5911 1.5677 5.4034 2.9184 5.7666 5.6684 3.3494 4.4688 1.6604 1.3737 2.8316 2.6403 4.5763 4.0761 1.6047 1.7667 1.5064 4.9979 1.9665 2.6440 1.4252 1.3961 1.9846 1.3556 1.4320 1.7810 2.1960 1.6578 2.3466 2.1470 3.3528 2.3645 1.7706 1.2777 1.1179 1.1063 1.4343 1.9860 2.4448 1.7911 1.7699 2.8641 1.7880 4.4770 2.5184 1.2506 3.4064 4.7368 3.1599 3.1813 2.4129 1.9089 1.5157 1.0484 2.1902 3.3693 2.8985 3.1995 7.7423 6.2278 6.5272 5.7856 7.6353 4.2124 1.0383 1.0984 1.0863 1.0865 1.0863 1.0896 1.0967 1.0897 1.0987 1.0955 1.0969 1.0977 1.0927 1.0944 1.0754
irintensity: 0.0070 1.7153 8.8231 1.3943 0.5788 3.4788 1.1390 4.9931 0.5534 0.1853 1.2791 1.1359 2.6603 0.4362 0.1955 0.2841 5.6682 4.4792 6.0068 5.2969 9.0109 1.9127 3.6998 3.6246 0.9295 6.0564 0.9203 29.7187 7.7389 29.2959 0.7789 2.0664 30.8713 12.6638 25.5475 82.1197 21.2628 3.7813 1.7813 7.1790 34.1917 2.1065 4.8154 2.1956 16.6795 11.3432 22.7967 7.2574 30.9402 1.7347 0.7305 1.7068 4.8677 7.7562 7.6315 6.3850 4.3296 5.5448 4.6935 2.0134 1.7037 1.4570 7.5863 46.4527 56.7970 8.3810 15.8042 54.0317 25.8626 35.7988 36.7014 59.2614 61.0294 6.4691 9.7019 1.4747 28.8909 57.9008 71.0396 20.7091 198.4612 8.7346 180.8136 236.1772 3.3771 35.3938 17.6808 5.3803 39.1916 85.5056 8.6888 14.9702 24.9854 2.4144 3.1127 11.6730 13.8929 6.9270 25.2291 59.6919 13.7356 10.7841 5.5938 15.6749 18.6556
temp: 298.150 k
press: 1.00000 atm
elementType: 8 7 6 6 6 6 6 6 6 6 6 6 6 6 6 6 6 6 6 6 6 6 1 1 1 1 1 1 1 1 1 1 1 1 1 1 1
symmnumber: 1
zpe: 763152.9 jmol-1
zpe.correction: 0.290670 hartree
zpe.thermalcorrener: 0.307151 hartree
zpe.thermalcorrenthalpy: 0.308095 hartree
zpe.thermalcorrgfe: 0.246361 hartree
zpe.sumelectzpe: -899.666171 hartree
zpe.sumelectthermal: -899.649689 hartree
zpe.sumelectthermalent: -899.648745 hartree
zpe.sumelectthermalfe: -899.710480 hartree
dipole: -0.9341 3.4598 0.6215
dipole: 3.6372
quadrupole: -101.3756 -120.8732 -133.6085
quadrupole: -14.1860 -2.8736 1.6929
quadrupole: 17.2435 -2.2541 -14.9894 -14.1860 -2.8736 1.6929
hfenergy: -899.9568404 hartree
pointgroup: C01 [X(C20H15N1O1)]
dipole: 0.4208501 1.3414146 -0.2668286 debye
polarizability: 389.2567704|9.9316982|278.9571097|1.439139|-14.0236917|100.2796294 unknown
InChI: InChI=1S/C20H15NO/c1-13(22)21-19-12-15-11-10-14-6-2-3-7-16(14)20(15)18-9-5-4-8-17(18)19/h2-12,21H,1H3
charge 0 multiplicity 1
37 atoms
O  3.931025 -2.624716 0.017106
N  3.499638 -0.324989 -0.234235
C  -0.794047 -0.045166 0.104964
C  0.029262 1.164992 0.135123
C  -0.114449 -1.295244 0.274751
C  -2.247007 -0.070351 -0.076794
C  1.473177 1.068404 0.019969
C  2.095714 -0.251664 -0.020398
C  -2.969659 -1.293643 0.216349
C  1.315942 -1.382995 0.193276
C  -0.86238 -2.505711 0.515819
C  -2.243363 -2.492642 0.551751
C  -0.523551 2.465223 0.385117
C  2.25135 2.270561 0.025812
C  -3.009984 1.014597 -0.627187
C  -4.394845 -1.330412 0.102119
C  0.263749 3.621729 0.405986
C  1.665145 3.530071 0.188929
C  -4.402721 0.944076 -0.762873
C  -5.113078 -0.222739 -0.358437
C  4.332913 -1.449851 -0.224633
C  5.795714 -1.126638 -0.53513
H  1.798185 -2.360124 0.261047
H  -0.304082 -3.43259 0.687578
H  -2.808111 -3.404167 0.779151
H  -1.58279 2.550667 0.634541
H  3.344906 2.234396 -0.047764
H  -2.493413 1.89524 -1.015608
H  -4.915479 -2.26183 0.355366
H  3.964346 0.557016 -0.452011
H  -0.197238 4.592459 0.617126
H  2.287803 4.430908 0.198175
H  -4.946246 1.787101 -1.203897
H  -6.203877 -0.263457 -0.448508
H  5.904525 -0.67333 -1.53805
H  6.372642 -2.061861 -0.5067
H  6.220381 -0.425821 0.207667
