program: Gaussian 09
title: 000263324
version: EM64L-G09RevD.01
frameworkgroup: C1[X(C19H20O3)]
method: RPBEPBE
basis: SDD
operation: Freq
keyword: #pfreq=noraman
keyword: PBEPBE/SDD
title: #p freq=noraman PBEPBE/SDD
converged: YES YES NO NO
title: Mulliken charges:
elementType: O O O C C C C C C C C C C C C C C C C C C C H H H H H H H H H H H H H H H H H H H H
charge: -0.435436 -0.439728 -0.266596 -0.103781 -0.362095 -0.526218 -0.527218 0.380371 0.223342 -0.267632 -0.239148 0.199624 0.187132 -0.581422 -0.373985 -0.357984 -0.343657 0.317106 -0.255016 -0.390699 -0.255669 -0.535701 0.202715 0.249798 0.210766 0.247392 0.204750 0.245885 0.239576 0.237079 0.278389 0.260237 0.255000 0.261084 0.330192 0.340894 0.227243 0.244499 0.229169 0.221884 0.245999 0.221859
chargesum: 0.00000
title: Mulliken charges with hydrogens summed into heavy atoms:
elementType: O O O C C C C C C C C C C C C C C C C C C C
charge: -0.105244 -0.098833 -0.266596 0.098933 -0.112297 -0.068060 -0.076583 0.380371 0.223342 -0.028056 -0.002069 0.199624 0.187132 -0.303032 -0.113748 -0.102985 -0.082573 0.317106 -0.027773 -0.146200 -0.026500 0.154041
polarizability: 2.68755050e+02 1.18206007e+01 2.10481003e+02 2.59373500e+00 2.37266128e+00 1.48516948e+02
1716.lowfreq: -16.8294 -6.0649 -4.4858 -0.0001 0.0002 0.0005 36.8075 55.8286 70.3897
frequency: 36.7928 55.7295 70.3883 79.9956 107.2200 110.2830 134.3755 152.2420 192.0384 201.1735 228.8319 239.7190 253.1836 271.9027 273.3401 291.7956 321.5137 334.4668 341.2697 385.3895 409.4803 415.1652 437.2847 456.2918 477.7719 506.0996 527.4649 537.9473 555.7347 598.2259 614.9997 630.9351 658.9849 686.9334 708.2539 730.2828 747.4398 749.4984 776.0653 807.8471 815.1169 820.7997 830.4218 854.7589 889.4736 897.0179 902.4458 924.6718 949.1875 956.8759 964.0946 971.1107 995.1932 1004.4330 1021.9666 1032.1435 1043.8545 1088.6987 1096.4966 1110.4331 1112.5270 1118.4388 1144.0868 1155.6234 1171.5208 1175.6221 1180.3376 1185.4151 1195.9576 1208.7701 1210.4476 1219.0580 1239.7904 1250.2776 1260.4781 1267.8643 1280.3431 1298.5796 1309.0092 1338.4418 1341.9589 1357.1019 1362.3278 1366.4395 1374.7544 1380.1830 1383.0762 1422.4732 1436.2554 1438.3809 1446.1672 1453.4909 1467.0348 1473.0558 1479.2121 1492.2426 1575.5994 1581.6987 1610.2925 1621.4448 2942.2416 2956.1593 2960.4496 2976.7766 2980.0875 3028.8303 3035.9380 3047.4128 3048.6571 3055.4385 3124.1491 3126.5854 3133.4874 3135.0418 3141.4716 3150.5140 3163.2692 3166.2828 3545.1123 3556.1186
redmass: 5.3466 4.1725 4.3042 4.4835 4.1209 4.3517 3.9412 4.2083 3.6897 1.9667 2.1635 1.9092 2.2535 1.7742 2.6708 1.5340 3.4738 3.6627 3.7754 2.9639 3.6681 3.6214 3.4477 3.2381 4.8744 3.7992 4.3707 4.4072 3.5966 4.4209 5.0645 4.3057 4.7226 4.4972 3.9053 4.4007 1.8698 3.9859 2.3897 2.5995 1.6500 2.8406 3.0500 3.6798 1.5400 1.8156 2.5346 3.4796 1.3968 2.6754 1.5220 2.5191 1.3242 3.7310 2.4332 2.4379 2.4641 2.1512 2.0170 1.8525 1.2645 1.6582 1.4482 1.3004 1.3799 1.1797 1.4948 1.4197 1.4890 1.7508 1.7044 1.4078 1.8725 1.8406 1.7675 1.6777 1.6070 1.4214 1.7595 1.4690 1.6092 1.5194 1.1482 1.1663 5.8941 1.9374 3.3399 3.2662 1.6578 1.4781 1.1347 1.0997 1.0499 1.0761 2.4515 2.6777 7.3259 6.9290 6.2376 6.8108 1.0814 1.0797 1.0329 1.0672 1.0651 1.0852 1.0859 1.0976 1.1040 1.0980 1.0849 1.0993 1.0889 1.0898 1.0915 1.0938 1.0999 1.0945 1.0661 1.0660
irintensity: 0.7736 1.1748 0.1694 0.4210 4.7106 4.8103 0.3204 2.4042 1.3178 8.8463 1.0055 32.3305 30.2148 46.6161 30.1131 102.3813 15.9553 2.4931 2.0419 3.6455 1.8876 8.1135 3.2177 5.1373 0.9302 4.2752 16.7474 11.3817 3.4155 3.5670 14.3417 1.6364 4.1492 12.2832 9.8806 9.8119 56.4252 6.3804 24.9470 8.0940 23.2410 12.5751 10.3837 33.4028 4.4198 19.9046 18.6274 14.1793 1.1070 19.6412 7.3615 36.9545 0.5218 35.2354 59.5666 16.4384 3.4135 19.5633 14.4745 29.7154 0.3460 15.8335 5.3384 54.0636 12.0336 9.6129 18.9236 6.4489 8.4551 31.7257 5.4792 21.8512 44.7401 77.2598 16.8228 43.6281 3.7163 8.2306 3.8506 9.2714 13.9542 5.3128 37.8123 30.1201 1.0883 7.3922 12.8298 8.8257 14.0469 5.1493 10.6524 4.4775 13.0284 46.3688 25.2109 69.7982 30.0909 1.9654 17.5738 107.1139 15.8586 18.9040 74.2565 30.5928 65.5996 37.1608 29.5456 13.4894 45.9670 35.5608 0.1584 25.9960 5.4915 8.4131 3.7629 16.8955 29.3256 15.4335 6.4188 3.5949
temp: 298.150 k
press: 1.00000 atm
elementType: 8 8 8 6 6 6 6 6 6 6 6 6 6 6 6 6 6 6 6 6 6 6 1 1 1 1 1 1 1 1 1 1 1 1 1 1 1 1 1 1 1 1
symmnumber: 1
zpe: 902841.7 jmol-1
zpe.correction: 0.343874 hartree
zpe.thermalcorrener: 0.362953 hartree
zpe.thermalcorrenthalpy: 0.363897 hartree
zpe.thermalcorrgfe: 0.297356 hartree
zpe.sumelectzpe: -960.085538 hartree
zpe.sumelectthermal: -960.066460 hartree
zpe.sumelectthermalent: -960.065515 hartree
zpe.sumelectthermalfe: -960.132056 hartree
dipole: -3.4717 -1.5128 0.3996
dipole: 3.8080
quadrupole: -118.7785 -135.7575 -125.7604
quadrupole: -0.3960 3.2550 6.7523
quadrupole: 7.9869 -8.9920 1.0051 -0.3960 3.2550 6.7523
hfenergy: -960.4294123 hartree
pointgroup: C01 [X(C19H20O3)]
dipole: -1.3276177 -0.6779721 0.1495408 debye
polarizability: 266.923756|15.4476737|212.2910643|3.9500332|1.6023689|148.5381813 unknown
InChI: InChI=1S/C19H20O3/c1-22-12-6-7-14-16(10-12)19-11(9-18(14)21)8-17(20)13-4-2-3-5-15(13)19/h2-7,10-11,17-21H,8-9H2,1H3
charge 0 multiplicity 1
42 atoms
O  -0.997474 3.650752 -0.677354
O  4.2376 1.336284 -0.186026
O  -4.125666 -1.68767 0.793602
C  1.038143 1.633994 0.890847
C  0.414294 0.213202 0.932381
C  1.006761 2.158075 -0.565112
C  2.435979 1.606391 1.542652
C  -0.999103 0.23742 0.346645
C  1.360985 -0.813314 0.263338
C  -0.438063 2.325074 -1.080115
C  3.42805 0.643121 0.857538
C  -1.373682 1.206407 -0.631937
C  2.773249 -0.612241 0.280777
C  -1.960247 -0.695748 0.793581
C  0.855393 -1.994121 -0.339736
C  -2.69033 1.181992 -1.150962
C  3.629892 -1.588632 -0.290618
C  -3.272397 -0.706482 0.265312
C  1.715177 -2.960801 -0.902033
C  -3.644833 0.23579 -0.726781
C  3.115039 -2.761903 -0.875213
C  -5.499998 -1.733531 0.287105
H  0.399897 2.30245 1.508067
H  0.328447 -0.085746 1.999522
H  1.529043 1.442894 -1.232242
H  1.514148 3.136215 -0.646582
H  2.31553 1.292894 2.600371
H  2.893291 2.612719 1.551317
H  -0.433405 2.41064 -2.181199
H  4.211396 0.356479 1.582139
H  -1.708953 -1.428457 1.568386
H  -0.226341 -2.153309 -0.381714
H  -2.973664 1.937625 -1.89276
H  4.710274 -1.403956 -0.277967
H  -1.256765 3.598641 0.278635
H  3.666262 1.481481 -0.982939
H  1.293886 -3.862883 -1.360122
H  -4.651795 0.248119 -1.153701
H  3.791369 -3.507491 -1.307629
H  -6.036739 -0.786937 0.492502
H  -5.979393 -2.558309 0.834257
H  -5.521956 -1.944225 -0.79983
