program: Gaussian 09
title: 000263321
version: EM64L-G09RevD.01
frameworkgroup: C1[X(C19H18O4)]
method: RPBEPBE
basis: SDD
operation: Freq
keyword: #pfreq=noraman
keyword: PBEPBE/SDD
title: #p freq=noraman PBEPBE/SDD
converged: YES YES NO NO
title: Mulliken charges:
elementType: O O O O C C C C C C C C C C C C C C C C C C C H H H H H H H H H H H H H H H H H H
charge: -0.211328 -0.259172 -0.406845 -0.241873 -0.110865 -0.379307 -0.581211 0.403702 -0.544017 0.125118 0.443806 0.022161 -0.420410 -0.522813 -0.401246 -0.429373 0.167495 -0.373081 0.330134 -0.240778 -0.234231 -0.244128 -0.536196 0.263452 0.253759 0.267840 0.250527 0.267574 0.278541 0.247085 0.303970 0.251057 0.264452 0.245389 0.225399 0.225803 0.228334 0.379123 0.249703 0.221022 0.221428
chargesum: 0.00000
title: Mulliken charges with hydrogens summed into heavy atoms:
elementType: O O O O C C C C C C C C C C C C C C C C C C C
charge: -0.211328 -0.259172 -0.027722 -0.241873 0.152586 -0.125547 -0.062844 0.403702 0.002098 0.125118 0.443806 0.022161 -0.173325 -0.218842 -0.150189 -0.164921 0.167495 -0.127693 0.330134 -0.015379 -0.008428 -0.015794 0.155958
polarizability: 2.65252700e+02 9.67799967e+00 1.96896858e+02 5.09030091e+00 6.28089058e+00 1.80406979e+02
1716.lowfreq: -7.9019 -5.5842 -0.0008 -0.0008 -0.0003 6.4832 27.3005 36.3334 41.9935
frequency: 27.2435 36.2591 41.9753 47.9351 53.8902 69.7955 85.5386 95.3284 127.6798 169.6888 171.5919 188.3438 222.6699 234.6197 255.4143 273.4870 279.9889 308.9084 349.9698 384.9848 405.1180 417.9658 448.6529 453.1979 491.7009 496.7805 520.7602 540.5698 544.7584 551.1201 588.3385 612.5943 616.1195 634.6947 645.7647 676.7607 695.6540 710.1171 748.9804 756.5253 805.7462 816.2643 835.3526 861.9348 865.1811 875.5741 885.0649 912.7841 931.3533 934.8276 953.8549 957.8741 985.0132 989.7236 998.1251 999.1556 1027.1250 1033.9976 1042.0763 1081.1340 1086.3756 1096.0199 1112.4321 1134.9213 1154.8316 1164.1010 1172.0936 1184.1910 1187.0204 1191.3233 1203.1583 1219.0754 1229.5225 1240.1879 1255.2824 1273.5152 1279.6579 1320.3234 1327.9995 1335.4099 1356.9350 1373.9474 1379.9565 1389.5781 1421.4728 1433.1915 1434.5244 1437.0098 1440.0726 1468.2157 1471.9948 1480.9068 1486.2360 1566.5853 1588.5016 1590.7889 1610.9635 1626.5133 1654.5847 2959.6234 2977.7425 2993.6190 3000.1733 3023.4310 3047.0083 3047.8388 3061.1747 3114.1561 3122.4156 3125.7559 3128.3837 3134.3263 3144.6637 3161.8231 3163.6111 3166.0169 3509.1601
redmass: 6.5307 8.1279 5.2857 4.2030 6.1687 6.2521 3.6507 4.1724 3.5008 4.1350 5.3030 4.2372 4.1382 1.2503 4.4548 4.5004 4.0613 3.1177 4.6652 4.7618 2.8670 3.3280 4.7330 3.9532 2.6610 2.9447 3.7467 5.6738 4.5589 3.2077 4.4606 3.6821 5.2481 3.6617 1.5215 4.3846 6.3916 1.9022 2.5879 2.5161 3.1655 2.1882 2.0674 1.2744 4.5540 3.8697 3.1501 2.0339 1.4998 1.8058 1.5132 1.9853 1.4228 5.4562 1.3851 3.8793 2.2452 2.8293 2.5078 1.6446 2.0307 2.1915 1.2593 1.5022 1.6088 1.3580 1.0626 2.1942 1.4595 1.1306 1.9325 1.4192 2.3108 1.7733 1.6764 2.0138 1.6122 1.5855 1.5269 1.3908 1.5213 1.9626 4.9914 5.1276 3.5698 1.1006 1.0987 1.2432 2.1219 1.0501 1.1030 2.2183 2.5637 7.1860 9.7291 6.0068 5.9550 7.4979 7.9740 1.0331 1.0640 1.0616 1.0829 1.0859 1.0968 1.1040 1.0955 1.0877 1.0860 1.0900 1.0986 1.0912 1.0958 1.1014 1.0934 1.0920 1.0639
irintensity: 1.2436 0.6268 0.1244 0.2218 2.7030 3.6513 3.3788 0.7233 0.5312 1.5264 0.4995 3.0475 2.4873 0.1294 1.1204 1.3806 9.1818 5.6338 2.4195 1.3516 0.1901 1.2995 0.8659 22.6564 25.6135 2.8422 6.6261 17.0042 23.9678 21.8074 9.5545 4.5764 0.8338 7.1656 116.0134 11.9669 3.1572 41.5687 19.8911 30.6075 23.5243 7.0926 11.3581 1.2089 3.9711 13.2890 14.1825 35.9153 4.5366 6.2994 0.8296 6.5633 0.7480 1.4850 5.1903 67.3940 19.5488 33.3840 205.8520 5.7579 71.3944 17.6617 0.1550 5.4271 1.9136 6.4426 0.0631 1.0685 5.3036 3.2762 48.6288 11.2042 69.0769 23.3634 18.2275 165.9147 81.1599 6.1404 31.3052 14.5957 16.5324 39.1473 16.9084 2.5006 87.4142 12.7273 20.6807 8.1544 9.0810 14.1970 58.9632 26.4849 83.9524 50.6936 172.5756 0.7640 10.7656 26.5958 186.2295 67.8806 8.2730 11.7401 7.6344 11.9246 9.2969 46.4822 21.7287 2.9274 0.8724 19.0677 14.8595 9.2839 34.7102 31.1138 8.9039 9.0544 27.7122
temp: 298.150 k
press: 1.00000 atm
elementType: 8 8 8 8 6 6 6 6 6 6 6 6 6 6 6 6 6 6 6 6 6 6 6 1 1 1 1 1 1 1 1 1 1 1 1 1 1 1 1 1 1
symmnumber: 1
zpe: 849551.9 jmol-1
zpe.correction: 0.323577 hartree
zpe.thermalcorrener: 0.344022 hartree
zpe.thermalcorrenthalpy: 0.344966 hartree
zpe.thermalcorrgfe: 0.272721 hartree
zpe.sumelectzpe: -1034.080840 hartree
zpe.sumelectthermal: -1034.060395 hartree
zpe.sumelectthermalent: -1034.059451 hartree
zpe.sumelectthermalfe: -1034.131696 hartree
dipole: 0.2093 -0.6182 -4.2700
dipole: 4.3196
quadrupole: -121.7689 -124.3226 -139.4207
quadrupole: -8.1722 -17.0105 -5.3203
quadrupole: 6.7352 4.1815 -10.9166 -8.1722 -17.0105 -5.3203
hfenergy: -1034.4044168 hartree
pointgroup: C01 [X(C19H18O4)]
dipole: 0.0227483 0.3362117 1.6657105 debye
polarizability: 266.7375399|-2.1207751|196.1322965|-4.0296209|4.822865|179.6867004 unknown
InChI: InChI=1S/C19H18O4/c1-23-14-7-8-15-16(11-14)17(20)9-13(10-18(21)22)19(15)12-5-3-2-4-6-12/h2-8,11,13,19,21H,9-10H2,1H3
charge 0 multiplicity 1
41 atoms
O  1.488301 -1.03023 -3.057391
O  4.789162 0.83444 0.266819
O  -1.145765 -4.528148 1.329733
O  -2.593978 -2.729166 1.527111
C  -1.294071 -1.305514 -0.652981
C  -0.897238 -0.214692 0.399722
C  -0.726044 -0.927397 -2.041175
C  0.604228 0.060766 0.371342
C  -0.833519 -2.717751 -0.225737
C  1.40125 -0.189938 -0.78855
C  -1.763695 1.044971 0.213523
C  0.789642 -0.746001 -2.040719
C  1.249144 0.583125 1.514541
C  2.790534 0.075884 -0.782338
C  -1.286251 2.226259 -0.406119
C  -3.113102 1.004361 0.655891
C  -1.624448 -3.269011 0.945172
C  2.633172 0.860082 1.530645
C  3.410551 0.602841 0.369527
C  -2.139476 3.340174 -0.586611
C  -3.96488 2.115619 0.478989
C  -3.481013 3.289579 -0.14638
C  5.476539 1.385709 1.437804
H  -2.39763 -1.316948 -0.718409
H  -1.154725 -0.623386 1.396095
H  -1.172846 0.038879 -2.35437
H  -0.987157 -1.669711 -2.816136
H  -0.94622 -3.434343 -1.063141
H  0.240686 -2.741136 0.040058
H  0.655539 0.783254 2.414514
H  3.379382 -0.130298 -1.681263
H  -0.242861 2.284052 -0.736507
H  -3.488171 0.094717 1.142675
H  3.090311 1.264593 2.438702
H  -1.754653 4.246524 -1.068073
H  -5.001976 2.069306 0.830501
H  -4.140286 4.154069 -0.283538
H  -1.692257 -4.869774 2.089285
H  6.527769 1.484041 1.130714
H  5.40483 0.702842 2.306813
H  5.073621 2.380454 1.711261
