program: Gaussian 09
title: 000024245
version: EM64L-G09RevD.01
frameworkgroup: C1[X(C4H6N4O4)]
method: RPBEPBE
basis: SDD
operation: Freq
keyword: #pfreq=noraman
keyword: PBEPBE/SDD
title: #p freq=noraman PBEPBE/SDD
converged: YES YES NO NO
title: Mulliken charges:
elementType: O O O O N N N N C C C C H H H H H H
charge: -0.180555 -0.180556 -0.200775 -0.200776 -0.120723 -0.120724 0.106300 0.106302 0.205011 0.205009 -0.616567 -0.616566 0.265534 0.274291 0.267486 0.265531 0.274290 0.267488
chargesum: 0.00000
title: Mulliken charges with hydrogens summed into heavy atoms:
elementType: O O O O N N N N C C C C
charge: -0.180555 -0.180556 -0.200775 -0.200776 -0.120723 -0.120724 0.106300 0.106302 0.205011 0.205009 0.190743 0.190743
polarizability: 1.01772470e+02 3.85021291e-04 9.04468838e+01 1.71816643e+00 -2.18719856e-04 8.46179852e+01
1716.lowfreq: -8.6455 -8.2590 -5.9159 0.0004 0.0004 0.0007 44.9687 68.7301 78.2000
frequency: 44.9659 68.7287 78.1988 112.7129 114.6922 132.7732 141.7394 194.7338 200.9122 284.8337 287.3396 322.1581 330.9646 342.9639 383.9984 396.9779 486.6309 504.5053 685.2657 722.9479 747.1956 772.8065 835.5836 871.1536 918.5026 1041.0461 1114.0115 1114.3490 1156.2305 1171.9354 1306.0639 1333.6314 1391.4037 1395.2363 1417.2933 1419.8375 1459.5179 1459.5431 1470.4781 1470.5465 1617.2171 1629.5979 3009.0422 3009.0858 3100.4698 3100.4730 3140.8003 3140.8438
redmass: 9.9445 4.0388 3.7893 1.0615 1.0622 12.7755 9.7046 9.4540 8.5501 3.3727 3.5171 7.9402 8.9350 7.8230 6.1314 6.1645 14.0244 12.0510 9.8810 10.3903 6.7187 7.6559 5.1119 2.8507 3.9411 10.4151 1.3403 1.3407 2.3692 2.1950 5.5941 5.6369 5.5472 5.7049 1.3245 1.3514 1.0422 1.0422 1.0927 1.1006 11.7218 11.9229 1.0326 1.0326 1.1015 1.1015 1.1022 1.1022
irintensity: 0.2241 5.8513 5.9424 0.0736 0.0574 0.8556 3.7763 15.5211 1.0536 0.4113 3.0849 54.4800 4.8832 3.3780 2.7405 2.8165 3.7915 0.4388 125.4750 7.9862 26.6884 95.2276 60.6655 119.4699 205.2571 114.4025 0.0215 0.4313 55.7615 5.5138 93.5086 30.6586 127.1126 128.9790 105.7257 34.4061 22.1945 22.8822 39.5425 40.1646 145.3370 168.1737 11.3909 0.6106 6.9869 7.4498 0.0880 0.0214
temp: 298.150 k
press: 1.00000 atm
elementType: 8 8 8 8 7 7 7 7 6 6 6 6 1 1 1 1 1 1
symmnumber: 1
zpe: 307750.9 jmol-1
zpe.correction: 0.117216 hartree
zpe.thermalcorrener: 0.130237 hartree
zpe.thermalcorrenthalpy: 0.131182 hartree
zpe.thermalcorrgfe: 0.077091 hartree
zpe.sumelectzpe: -674.873466 hartree
zpe.sumelectthermal: -674.860445 hartree
zpe.sumelectthermalent: -674.859500 hartree
zpe.sumelectthermalfe: -674.913592 hartree
dipole: 0.0000 -0.1976 -0.0001
dipole: 0.1976
quadrupole: -53.4602 -79.7972 -76.2277
quadrupole: -0.0005 -8.4757 0.0001
quadrupole: 16.3681 -9.9688 -6.3993 -0.0005 -8.4757 0.0001
hfenergy: -674.9906821 hartree
pointgroup: C01 [X(C4H6N4O4)]
dipole: 0.0000135 0.0777354 -0.0001011 debye
dipolederiv: -0.5991426 0.0574896 -0.0538527 0.1764173 -0.6834433 -0.2770989 0.0876832 -0.402498 -0.6111922 -0.5991698 -0.0575892 -0.0537509 -0.1762873 -0.682444 0.2771986 0.0879777 0.4026019 -0.6121713 -0.5598593 0.5578951 0.4691053 0.243509 -0.6041823 -0.4198027 -0.021838 -0.1151285 -0.3035296 -0.5598448 -0.5572038 0.4698537 -0.2436148 -0.603461 0.4202772 -0.0215358 0.1154609 -0.3042325 -0.5737594 0.2945533 0.0998301 0.4959076 -0.789974 -0.5332025 0.3161128 -0.5855099 -0.5912625 -0.5738129 -0.2944983 0.1002946 -0.4954241 -0.7882969 0.533389 0.316887 0.5858453 -0.5928901 0.1488685 -0.3485248 -0.327799 -0.3343825 0.8241776 0.7892453 -0.265219 0.707723 0.6637096 0.1488212 0.3481284 -0.3282766 0.3341066 0.822081 -0.7894479 -0.2656768 -0.7078939 0.6658017 1.2491621 -0.5232935 -0.1993062 -0.522027 1.0183878 0.4963993 -0.2355996 0.5115783 0.5799996 1.2492581 0.5230132 -0.2000799 0.521653 1.0168632 -0.4970174 -0.2364197 -0.5121914 0.5814369 0.1452443 0.0074985 -0.0277184 0.075135 0.0958227 -0.0543828 0.0749386 -0.100514 0.0973328 0.1452632 -0.0075301 -0.0277208 -0.0750667 0.0960332 0.0544084 0.0750346 0.1004796 0.0971094 -0.0208183 -0.0317355 0.0199345 -0.0079428 0.1019084 0.0148261 0.0810621 0.0379984 0.0154638 0.1463712 0.0369907 0.0365988 -0.0125199 0.0757125 -0.0798046 -0.0139945 -0.0501896 0.0721187 0.0639377 -0.0266373 -0.0168122 0.0173168 -0.03839 0.0794422 -0.0232421 0.0164121 0.0773421 -0.0208211 0.0317834 0.0198894 0.0080851 0.1018156 -0.014962 0.0810448 -0.0381307 0.0155411 0.1463618 -0.036939 0.0366693 0.0124969 0.0759179 0.0798026 -0.0139971 0.0501826 0.0719244 0.06394 0.0265993 -0.0168589 -0.0173623 -0.0385284 -0.0792698 -0.0232182 -0.0162262 0.0774981 unknown
polarizability: 101.9356303|0.0003491|90.4468813|0.3557239|-0.0038648|84.4548271 unknown
InChI: InChI=1S/C4H6N4O4/c1-7(5-11)3(9)4(10)8(2)6-12/h1-2H3
charge 0 multiplicity 1
18 atoms
O  -0.53461 -1.662214 -1.5029
O  0.534352 -1.660067 1.505424
O  -2.4159 1.656261 1.038157
O  2.415807 1.65476 -1.040258
N  -1.638436 0.008219 -0.285466
N  1.638325 0.008495 0.285559
N  -1.443766 0.871825 0.829037
N  1.443754 0.870468 -0.830223
C  -0.551243 -0.86103 -0.541182
C  0.551055 -0.860285 0.54254
C  -2.846603 0.051713 -1.123535
C  2.846475 0.053132 1.123594
H  -3.736956 -0.169411 -0.510911
H  -2.728695 -0.700686 -1.917136
H  -2.963668 1.057006 -1.562653
H  3.736822 -0.169038 0.511342
H  2.728448 -0.698036 1.918341
H  2.963642 1.059087 1.56117
