program: Gaussian 09
title: 000263315
version: EM64L-G09RevD.01
frameworkgroup: C1[X(C19H18ClNO4)]
method: RPBEPBE
basis: SDD
operation: Freq
keyword: #p
keyword: freq=noraman
keyword: PBEPBE/SDD
title: #p freq=noraman PBEPBE/SDD
converged: YES YES NO NO
title: Mulliken charges:
elementType: Cl O O O O N C C C C C C C C C C C C C C C C C C C H H H H H H H H H H H H H H H H H H
charge: -0.007494 -0.219793 -0.162999 -0.420341 -0.232732 -0.375241 -0.202957 0.372740 -0.565012 -0.147875 -0.613117 0.189355 -0.592702 0.242412 0.449015 0.483381 -0.357233 0.178979 -0.354850 -0.812829 -0.400071 -0.412630 -0.234564 -0.228237 -0.239360 0.308696 0.265020 0.309232 0.305361 0.231558 0.242383 0.244626 0.263818 0.240866 0.240743 0.227367 0.229410 0.256821 0.237019 0.226900 0.226740 0.378191 0.229402
chargesum: 0.00000
title: Mulliken charges with hydrogens summed into heavy atoms:
elementType: Cl O O O O N C C C C C C C C C C C C C C C C C C C
charge: -0.007494 -0.219793 -0.162999 -0.042150 -0.232732 -0.069880 0.105739 0.372740 -0.255781 0.117145 -0.139176 0.189355 -0.348076 0.242412 0.449015 0.483381 -0.093414 0.178979 -0.113983 -0.115308 -0.143250 -0.175611 -0.007664 -0.001497 -0.009958
polarizability: 2.90075840e+02 -1.99843428e+01 2.45044167e+02 1.84348970e+01 4.51113748e+00 1.63155495e+02
1716.lowfreq: -37.4201 -12.4065 -4.3452 -1.7650 -0.0020 -0.0014 -0.0004 9.0224 16.4755
frequency: -37.3832 7.8448 16.2639 30.6987 39.6061 46.2409 56.9359 68.2367 74.5260 77.1380 103.6083 150.0253 160.5862 182.0852 189.3297 201.1448 231.9762 243.5239 289.1981 325.1053 345.7602 347.7764 366.3019 388.4411 403.7562 404.4968 435.5073 474.0620 480.4151 498.6517 519.0496 539.7186 558.1921 579.8836 582.3720 595.0731 613.6746 617.8631 637.0850 665.3245 705.4724 710.9150 723.6467 748.6196 756.4813 762.7705 789.7187 813.4631 821.9399 835.1821 858.3742 861.9556 898.4718 913.9746 925.9905 965.6251 971.2312 980.6270 989.6886 990.8582 997.5023 1013.1772 1014.2717 1027.0540 1048.5053 1053.3313 1071.7385 1090.9184 1110.9031 1115.9797 1141.1155 1162.7345 1172.4872 1177.5417 1183.9670 1189.8526 1196.0030 1216.8515 1229.6171 1240.0443 1259.8563 1279.8168 1284.9520 1311.8773 1327.4304 1339.8756 1342.1826 1353.6883 1379.6278 1382.6388 1401.0910 1425.1144 1441.8719 1449.7472 1467.3074 1472.0221 1477.8917 1484.6794 1486.0232 1593.1095 1600.2704 1614.7849 1624.9334 1653.4116 1683.5383 2978.5371 2980.9797 3004.0474 3049.4309 3059.4208 3071.0502 3087.4329 3114.2790 3119.7518 3122.1174 3124.7478 3135.8322 3136.3289 3147.1014 3163.6591 3172.9873 3488.5698 3491.7652
redmass: 1.0174 6.2800 5.8712 4.8990 5.7299 5.9674 7.6436 5.2410 6.7943 6.9235 9.4515 7.4455 6.2747 5.8346 5.8415 4.9440 6.4815 4.4717 4.1147 4.6618 2.5049 3.5923 4.5967 4.7525 3.9823 3.4381 4.2465 4.2133 4.0125 2.3557 2.9001 4.9844 3.6222 5.1656 5.1665 2.5051 3.5846 6.3000 1.6863 6.0342 2.7120 2.3448 5.4207 3.5492 4.9030 2.2725 3.5545 4.6917 3.7088 1.4664 1.2578 5.5187 1.4001 3.6878 1.4341 1.3497 1.9037 1.4259 2.0098 4.2816 1.3188 2.1202 3.7796 2.2275 1.5679 3.0669 1.9584 2.4900 2.8249 2.6596 2.2608 2.1222 1.1081 1.3404 1.2225 1.1272 1.7615 2.4408 1.4616 1.5903 2.4879 1.4286 1.4194 1.3313 1.3381 1.3229 1.5550 1.5512 6.7650 7.3562 1.2270 2.4803 2.1350 1.4198 1.1230 1.0576 1.2233 2.2529 2.5141 6.0296 7.1897 6.1012 7.0383 8.1877 11.7349 1.0385 1.0850 1.0601 1.0865 1.0957 1.1014 1.0996 1.0876 1.0917 1.0881 1.0861 1.0900 1.0915 1.0961 1.1015 1.0956 1.0763 1.0639
irintensity: 0.5533 0.3696 1.4775 0.2090 0.2102 0.7810 0.6131 0.5153 1.5077 0.5279 0.1242 2.4842 0.2798 0.1825 1.2029 0.7900 1.3614 1.8432 10.5642 4.4406 0.8258 2.8931 5.5187 0.7039 0.1700 0.2150 4.3978 4.7567 4.5896 53.0993 87.8311 34.9754 25.2954 10.5373 4.9793 65.5974 19.6286 0.9497 76.4699 10.9698 41.2471 46.4267 1.1741 41.6210 4.8751 22.3349 3.1473 6.5486 4.5074 54.5779 1.2382 57.6114 2.9240 13.5689 2.8514 1.7913 3.3702 0.9168 25.3554 5.3441 0.3684 16.6498 155.3821 8.1069 14.3288 80.2753 15.6414 20.4335 61.9377 128.6932 171.4512 6.7768 3.2307 21.5958 31.9424 0.3540 38.6718 1.2907 5.8915 1.4340 11.5073 3.0153 9.6960 13.9098 0.9062 0.4763 8.2592 6.4811 3.4069 0.2830 10.5164 2.8972 10.7963 43.9715 12.5193 12.1480 30.3400 24.8066 96.6185 2.1011 2.6005 7.2880 16.8112 194.7576 308.9942 32.6258 9.2186 15.5542 5.4615 18.0109 8.8165 15.5228 8.8352 10.5008 4.9756 0.2063 14.9213 14.8688 31.6879 24.4625 3.3400 10.0513 18.3621
temp: 298.150 k
press: 1.00000 atm
elementType: 17 8 8 8 8 7 6 6 6 6 6 6 6 6 6 6 6 6 6 6 6 6 6 6 6 1 1 1 1 1 1 1 1 1 1 1 1 1 1 1 1 1 1
symmnumber: 1
zpe: 864971.0 jmol-1
zpe.correction: 0.329450 hartree
zpe.thermalcorrener: 0.352107 hartree
zpe.thermalcorrenthalpy: 0.353052 hartree
zpe.thermalcorrgfe: 0.272977 hartree
zpe.sumelectzpe: -1548.740268 hartree
zpe.sumelectthermal: -1548.717611 hartree
zpe.sumelectthermalent: -1548.716666 hartree
zpe.sumelectthermalfe: -1548.796741 hartree
dipole: -0.3976 5.0430 1.6882
dipole: 5.3330
quadrupole: -133.9090 -161.2752 -154.9495
quadrupole: -16.2920 7.4004 1.1028
quadrupole: 16.1356 -11.2306 -4.9050 -16.2920 7.4004 1.1028
hfenergy: -1549.069718 hartree
pointgroup: C01 [X(C19H18Cl1N1O4)]
dipole: -0.281422 2.0069246 0.5433864 debye
polarizability: 292.7419961|-15.736116|243.0389887|18.1991722|0.873773|162.4945173 unknown
InChI: InChI=1S/C19H18ClNO4/c1-11-7-8-15-13(9-11)17(16(20)19(24)25-15)21-14(18(22)23)10-12-5-3-2-4-6-12/h2-9,14,16-17,21-22H,10H2,1H3
charge 0 multiplicity 1
43 atoms
Cl -2.194653 -2.331988 2.304598
O  -2.692324 -2.222366 -1.075493
O  -1.028799 -3.759777 -0.748781
O  1.072568 1.65387 1.918931
O  1.441487 2.714996 -0.11746
N  -0.166471 -0.041132 -0.472348
C  -1.192675 -0.349097 0.559038
C  -2.574133 -0.003262 0.034372
C  -1.101588 -1.868321 0.814869
C  1.223937 0.228783 -0.040634
C  2.209903 0.048455 -1.222467
C  -3.259993 -0.95229 -0.755425
C  -3.192795 1.243561 0.274283
C  -1.56202 -2.70383 -0.377769
C  -4.467049 1.557228 -0.258821
C  3.668398 0.09916 -0.784921
C  -4.524185 -0.677054 -1.306314
C  1.299473 1.65593 0.533244
C  -5.117368 0.577119 -1.056698
C  -5.134164 2.889534 0.032768
C  4.398452 1.315335 -0.804935
C  4.315993 -1.076834 -0.324231
C  5.743779 1.355137 -0.37341
C  5.660197 -1.039848 0.108792
C  6.378755 0.178353 0.086345
H  -0.998989 0.183482 1.512509
H  1.483114 -0.476635 0.767377
H  -0.092996 -2.193856 1.103417
H  -0.49902 0.576376 -1.221659
H  2.004753 0.835809 -1.972218
H  1.971865 -0.928104 -1.681026
H  -2.669193 1.981613 0.895293
H  -5.019673 -1.437355 -1.916884
H  -6.102218 0.798079 -1.484381
H  -5.882213 2.79146 0.843083
H  -4.401201 3.650781 0.35107
H  -5.664701 3.278762 -0.854418
H  3.907431 2.229521 -1.158649
H  3.768703 -2.028331 -0.318711
H  6.295965 2.301416 -0.399025
H  6.148041 -1.957942 0.455326
H  1.085534 2.589464 2.263157
H  7.422771 0.207992 0.417905
