program: Gaussian 09
title: 000263313
version: EM64L-G09RevD.01
frameworkgroup: C1[X(C19H16O3)]
method: RPBEPBE
basis: SDD
operation: Freq
keyword: #pfreq=noraman
keyword: PBEPBE/SDD
title: #p freq=noraman PBEPBE/SDD
converged: YES YES NO NO
title: Mulliken charges:
elementType: O O O C C C C C C C C C C C C C C C C C C C H H H H H H H H H H H H H H H H
charge: -0.211358 -0.205748 -0.256511 -0.137577 -0.385214 -0.563454 -0.550159 0.336522 0.459886 0.127787 0.124195 0.031846 -0.023033 -0.379048 -0.438351 -0.519576 -0.374224 -0.381448 0.335902 -0.238310 -0.237222 -0.535594 0.239125 0.251902 0.244431 0.258568 0.266432 0.254698 0.252922 0.253183 0.304588 0.283453 0.245978 0.234011 0.237708 0.222640 0.220826 0.250223
chargesum: 0.00000
title: Mulliken charges with hydrogens summed into heavy atoms:
elementType: O O O C C C C C C C C C C C C C C C C C C C
charge: -0.211358 -0.205748 -0.256511 0.101548 -0.133312 -0.060455 -0.029029 0.336522 0.459886 0.127787 0.124195 0.031846 -0.023033 -0.126126 -0.185168 -0.214988 -0.090771 -0.135470 0.335902 -0.004299 0.000486 0.158095
polarizability: 2.47539892e+02 -1.41579201e+01 2.29266235e+02 -2.97774895e+00 1.02121179e+01 1.54343805e+02
1716.lowfreq: -12.1846 -5.3202 -0.0010 -0.0006 -0.0004 7.0487 32.8009 52.2007 61.6918
frequency: 32.7118 52.1783 61.6804 79.2380 96.4175 126.2084 148.3152 174.7471 193.5803 221.2454 234.9936 257.8587 280.3974 287.8880 302.2540 331.1541 385.9954 403.2528 418.4284 423.3040 458.5946 481.4062 503.5292 521.8743 529.1652 553.0987 560.5223 575.8665 604.3961 626.5277 639.6491 682.5611 692.8015 711.5488 737.2848 760.0905 776.3876 804.6089 831.5623 847.7046 869.0142 891.7340 902.4426 911.6935 934.9503 961.7006 968.4544 981.3268 1001.5165 1008.4399 1017.6531 1028.8572 1052.6386 1074.4210 1086.4964 1111.5264 1112.8045 1131.0861 1152.1574 1162.2697 1169.8972 1173.4743 1200.9719 1207.5415 1219.1095 1223.8074 1243.7022 1258.8243 1275.3719 1278.2094 1285.4847 1295.2024 1312.3407 1349.2674 1360.9291 1381.6740 1386.0433 1419.8152 1431.1112 1434.1888 1437.6312 1441.8775 1468.4911 1471.9273 1472.6825 1482.0590 1564.7028 1572.3348 1585.4837 1587.3975 1617.3298 1626.3920 2944.3090 2960.3819 2961.9903 2977.3075 2998.4193 3049.1310 3054.2156 3058.3229 3118.0154 3128.9488 3136.6576 3143.3205 3150.2433 3164.5449 3165.8750 3166.3445
redmass: 7.0778 5.7503 5.1572 3.7042 4.1246 4.4687 3.5113 4.4953 3.6873 2.6155 1.4528 3.9146 4.7663 3.7168 5.4903 4.9863 5.1141 3.5054 3.4589 3.9291 5.5489 4.5609 6.5868 3.6272 3.6137 4.2896 5.6475 3.2040 4.0885 3.5469 4.6391 5.0242 5.7213 3.4711 4.0505 2.9612 1.7846 1.9841 2.1538 2.9408 4.0376 2.5298 1.5382 2.4485 1.6147 1.3740 2.5717 1.4375 3.9858 1.3928 3.4306 2.6971 2.8538 2.1665 2.0345 1.8270 1.2688 1.6279 1.3498 1.3705 1.7248 1.0830 2.0446 1.5247 1.8534 2.3323 1.8818 1.5711 1.7877 2.3461 1.8149 1.5293 1.7307 1.4906 1.5898 6.4825 6.4991 3.1154 1.1672 1.1368 1.2868 2.0212 1.0522 1.1234 2.5394 2.4183 6.9571 8.0497 9.7693 7.4673 7.4980 7.3486 1.0819 1.0331 1.0666 1.0658 1.0831 1.1041 1.0938 1.0950 1.0878 1.0992 1.0888 1.0875 1.0933 1.0938 1.0996 1.0935
irintensity: 2.8567 2.3056 3.1103 2.4239 1.1117 1.7400 1.6231 1.8439 3.1279 1.8404 0.4147 2.1347 7.6389 0.5396 7.1348 2.3241 0.4686 3.7875 0.8345 2.1930 1.8285 4.7353 5.3681 4.4854 16.8825 1.4503 10.3198 2.9082 11.1660 4.3657 9.6657 3.1802 6.1684 6.7263 1.8856 28.5409 34.3692 18.7200 28.7802 4.0671 7.2564 4.6284 2.7598 8.1454 13.2389 1.5120 19.6639 11.4520 60.1840 1.0601 8.7462 6.3716 3.3157 0.8839 0.0094 13.4946 0.3094 5.6342 1.3883 0.8905 10.9856 3.8115 29.5351 13.6933 10.6697 56.6405 50.7471 55.4638 109.9673 123.3248 77.3581 9.4554 7.5376 6.6487 3.1189 19.0854 3.3790 98.1672 17.9834 8.7258 5.7785 18.9201 16.7335 63.7197 9.9386 79.8895 78.2898 62.2939 157.2672 120.8292 48.0042 22.5636 18.3272 63.3732 15.1407 2.0569 42.0648 45.8960 6.4979 22.2527 7.2155 24.1196 9.8540 3.3635 7.2867 2.6859 23.1227 20.2141
temp: 298.150 k
press: 1.00000 atm
elementType: 8 8 8 6 6 6 6 6 6 6 6 6 6 6 6 6 6 6 6 6 6 6 1 1 1 1 1 1 1 1 1 1 1 1 1 1 1 1
symmnumber: 1
zpe: 784663.6 jmol-1
zpe.correction: 0.298863 hartree
zpe.thermalcorrener: 0.316597 hartree
zpe.thermalcorrenthalpy: 0.317541 hartree
zpe.thermalcorrgfe: 0.253118 hartree
zpe.sumelectzpe: -957.759331 hartree
zpe.sumelectthermal: -957.741596 hartree
zpe.sumelectthermalent: -957.740652 hartree
zpe.sumelectthermalfe: -957.805076 hartree
dipole: 0.6764 -5.5594 -3.2980
dipole: 6.4993
quadrupole: -130.5773 -119.6994 -131.8071
quadrupole: 12.7972 -12.4226 -4.0058
quadrupole: -3.2160 7.6619 -4.4458 12.7972 -12.4226 -4.0058
hfenergy: -958.0581932 hartree
pointgroup: C01[X(C19H16O3)]
dipole: 0.3654459 2.170586 1.3013234 debye
polarizability: 248.8594052|13.0709257|227.8737758|4.3140603|10.1809178|154.4167509 unknown
InChI: InChI=1S/C19H16O3/c1-22-12-6-7-15-16(10-12)18(21)9-11-8-17(20)13-4-2-3-5-14(13)19(11)15/h2-7,10-11,19H,8-9H2,1H3
charge 0 multiplicity 1
38 atoms
O  -2.637009 -3.088293 0.326116
O  2.907631 -1.198988 -2.478251
O  -4.494118 1.465642 -0.671337
C  0.891461 -1.957273 0.54332
C  0.672428 -0.511352 1.071068
C  -0.296252 -2.855821 0.944641
C  1.128913 -1.933818 -0.985036
C  -0.671247 0.052196 0.564894
C  1.875769 0.358981 0.720116
C  -1.781579 -0.82562 0.341235
C  2.616282 0.123193 -0.477043
C  -1.65669 -2.309839 0.512873
C  2.274057 -1.010899 -1.398122
C  -0.871956 1.432933 0.349674
C  2.28532 1.409319 1.576439
C  -3.033835 -0.315081 -0.069666
C  3.724337 0.950397 -0.80238
C  -2.12009 1.951113 -0.063009
C  -3.212199 1.069749 -0.26945
C  3.3911 2.225207 1.250486
C  4.110362 2.000622 0.050579
C  -4.725135 2.895156 -0.897424
H  1.805133 -2.357574 1.026686
H  0.605021 -0.566244 2.1793
H  -0.322667 -2.953931 2.051402
H  -0.19569 -3.879917 0.542236
H  0.216664 -1.579639 -1.508573
H  1.342342 -2.94305 -1.380444
H  -0.037953 2.127234 0.491605
H  1.737756 1.582747 2.510999
H  -3.863683 -1.008724 -0.235989
H  4.266253 0.737333 -1.730026
H  -2.225466 3.028482 -0.222611
H  3.694358 3.029513 1.93012
H  4.966535 2.634195 -0.204403
H  -4.078678 3.284507 -1.707852
H  -4.558671 3.481364 0.02732
H  -5.780204 2.969376 -1.197893
