program: Gaussian 09
title: 000263301
version: EM64L-G09RevD.01
frameworkgroup: C1[X(C19H13FO2)]
method: RPBEPBE
basis: SDD
operation: Freq
keyword: #p
keyword: freq=noraman
keyword: PBEPBE/SDD
title: #p freq=noraman PBEPBE/SDD
converged: YES YES NO NO
title: Mulliken charges:
elementType: F O O C C C C C C C C C C C C C C C C C C C H H H H H H H H H H H H H
charge: -0.200458 -0.271268 -0.203430 0.034789 0.311196 0.319660 -0.693849 0.061814 0.231565 0.083040 -0.351862 -0.352167 0.174825 -0.367845 -0.394651 -0.231856 -0.412757 -0.236956 -0.219569 0.162406 -0.257214 -0.401896 0.256093 0.216553 0.240236 0.288861 0.248982 0.271255 0.218143 0.237240 0.270018 0.234047 0.239096 0.235293 0.260668
chargesum: 0.00000
title: Mulliken charges with hydrogens summed into heavy atoms:
elementType: F O O C C C C C C C C C C C C C C C C C C C
charge: -0.200458 -0.271268 -0.203430 0.034789 0.311196 0.319660 0.019033 0.061814 0.231565 0.083040 -0.063001 -0.103185 0.174825 -0.096591 -0.176508 0.005384 -0.142740 -0.002909 0.019527 0.162406 -0.021921 -0.141228
polarizability: 2.64679986e+02 2.15762036e+01 2.26825488e+02 8.49735028e+00 1.42171400e+01 1.32857020e+02
1716.lowfreq: -8.1560 -4.7889 0.0005 0.0006 0.0007 6.0695 35.0675 46.8515 53.3210
frequency: 35.0385 46.8446 53.3181 99.4823 131.8494 138.3263 166.5437 174.0530 185.0011 225.9032 249.6632 258.0255 278.7991 299.3594 303.2135 352.2698 414.6627 452.4958 465.9853 468.1894 482.5641 501.6226 520.1947 523.2427 554.6796 564.0816 583.7253 595.2062 628.3121 661.8873 674.3741 676.2952 720.0386 745.5817 766.8594 778.7907 785.9494 791.4117 798.8038 826.3498 850.1163 852.5246 882.2919 885.7895 891.5572 948.2896 963.7254 967.2721 975.5761 1000.1604 1002.8399 1022.9236 1035.0214 1047.8792 1071.5164 1081.4296 1096.8283 1111.4805 1148.0749 1175.7365 1177.9426 1189.1137 1197.6654 1219.4357 1233.2498 1245.3200 1251.0459 1284.4406 1359.0360 1387.8003 1394.5828 1400.2128 1410.5031 1424.4380 1448.2429 1454.8451 1457.8404 1462.5787 1468.5161 1514.4119 1583.4072 1597.4584 1601.9891 1618.0394 1636.6270 1699.1702 3012.9543 3108.8879 3134.2490 3137.3654 3145.9814 3146.5038 3151.5454 3168.6561 3174.2212 3181.4046 3185.1095 3189.8709 3199.1571
redmass: 6.7107 4.8995 6.0606 3.1433 4.9104 1.5075 3.1981 4.4726 4.4490 5.1240 6.4811 5.5881 4.6744 4.4986 4.8405 4.7217 3.3021 4.8107 3.3369 5.9100 6.3369 4.6590 7.3491 7.0349 6.3127 5.1136 5.9050 3.6273 5.5898 4.9336 5.8020 4.7553 5.4041 1.6115 2.2936 5.0535 1.9731 5.4059 1.5027 2.4126 3.9663 5.0924 1.8251 1.9228 1.5104 1.3761 1.3344 1.3981 4.1623 1.3563 1.3406 2.6047 3.4517 2.3184 2.8158 2.0751 2.0825 2.0729 2.2969 1.2495 1.2641 1.3601 2.0357 1.9798 2.9434 2.1723 2.3318 1.4837 3.2319 1.9002 1.6724 5.5068 3.1217 3.7122 2.4688 1.8542 1.7849 1.4320 1.1050 4.4374 7.1707 6.9951 6.1414 7.2041 7.4680 12.9100 1.0364 1.1012 1.0976 1.0866 1.0879 1.0888 1.0912 1.0981 1.0953 1.0943 1.0954 1.0942 1.0926
irintensity: 0.5586 0.9695 1.3168 1.8354 0.8490 0.5374 1.5928 0.7098 1.4561 1.9260 0.2138 2.3237 0.2262 2.9986 8.0069 0.1777 1.1610 2.7994 0.0584 1.3252 2.6467 4.6910 0.2271 0.5528 4.3993 6.7725 5.3547 2.3404 5.2172 11.4060 9.9584 21.4711 4.2783 4.0911 25.6295 5.5804 31.7327 7.7304 111.0225 16.8737 15.1227 70.4648 5.0455 6.4528 1.0567 1.5358 2.5964 1.7249 174.4621 2.5016 0.2069 5.6714 13.6182 1.5680 31.7940 40.0854 6.8254 1.2935 42.3586 2.6239 11.4445 1.2896 7.3915 28.6049 72.7432 17.5738 20.0906 3.9373 32.6129 10.6494 12.7646 4.0030 53.0446 2.6420 13.3992 5.5756 6.6505 14.4948 8.7832 33.6932 1.2284 6.6186 28.0873 16.4063 9.2923 425.9948 12.8400 20.6560 16.7436 2.0825 11.3479 2.7216 6.4496 18.8845 6.2018 6.4816 5.4868 4.0060 15.7251
temp: 298.150 k
press: 1.00000 atm
elementType: 9 8 8 6 6 6 6 6 6 6 6 6 6 6 6 6 6 6 6 6 6 6 1 1 1 1 1 1 1 1 1 1 1 1 1
symmnumber: 1
zpe: 691703.8 jmol-1
zpe.correction: 0.263456 hartree
zpe.thermalcorrener: 0.280670 hartree
zpe.thermalcorrenthalpy: 0.281615 hartree
zpe.thermalcorrgfe: 0.218413 hartree
zpe.sumelectzpe: -980.630229 hartree
zpe.sumelectthermal: -980.613015 hartree
zpe.sumelectthermalent: -980.612071 hartree
zpe.sumelectthermalfe: -980.675272 hartree
dipole: 0.9610 5.0627 0.2110
dipole: 5.1575
quadrupole: -137.9343 -119.7453 -123.7542
quadrupole: -13.0875 6.8131 4.0642
quadrupole: -10.7897 7.3993 3.3903 -13.0875 6.8131 4.0642
hfenergy: -980.8936851 hartree
pointgroup: C01 [X(C19H13F1O2)]
dipole: 0.3668268 -1.9956615 0.0046091 debye
polarizability: 264.7092445|-22.3384775|228.0544934|-4.5245432|9.9746471|131.5987567 unknown
InChI: InChI=1S/C19H13FO2/c1-19(16-9-3-2-6-14(16)18(21)22-19)15-10-4-8-13-12(15)7-5-11-17(13)20/h2-11H,1H3
charge 0 multiplicity 1
35 atoms
F  5.074479 0.115023 1.064213
O  -1.839799 1.607259 -0.951906
O  -3.971959 2.204601 -0.210726
C  -0.943944 0.382343 -0.949918
C  -1.768954 -0.626455 -0.120829
C  0.397486 0.798799 -0.293531
C  -0.849442 0.027839 -2.456026
C  -3.010069 -0.040685 0.219967
C  1.571754 -0.057285 -0.26927
C  -3.073472 1.3490 -0.290263
C  0.468898 2.066242 0.303509
C  -1.490358 -1.942084 0.302055
C  2.768185 0.447376 0.391546
C  -3.997976 -0.723167 0.95635
C  1.648135 -1.373377 -0.849203
C  1.650307 2.538185 0.947616
C  2.790474 1.742228 0.996969
C  -2.47579 -2.640711 1.042465
C  -3.721497 -2.044983 1.365871
C  3.925725 -0.391559 0.417387
C  2.813087 -2.141339 -0.794419
C  3.988201 -1.654791 -0.147475
H  -0.386494 0.871934 -2.993427
H  -0.255525 -0.876254 -2.65105
H  -1.86557 -0.129018 -2.855417
H  -0.406637 2.716481 0.257734
H  -0.533865 -2.42596 0.094283
H  -4.942987 -0.225304 1.196639
H  0.786687 -1.793754 -1.367767
H  1.650007 3.535675 1.398753
H  3.706424 2.085529 1.485558
H  -2.265661 -3.662736 1.376861
H  -4.46263 -2.61126 1.939517
H  2.832456 -3.134017 -1.255579
H  4.907225 -2.244073 -0.094889
