program: Gaussian 09
title: 000263274
version: EM64L-G09RevD.01
frameworkgroup: C1[X(C17H11FO)]
method: RPBEPBE
basis: SDD
operation: Freq
keyword: #p
keyword: freq=noraman
keyword: PBEPBE/SDD
title: #p freq=noraman PBEPBE/SDD
converged: YES YES NO NO
title: Mulliken charges:
elementType: F O C C C C C C C C C C C C C C C C C H H H H H H H H H H H
charge: -0.187158 -0.214851 0.371784 0.376744 0.354624 -0.518914 -0.422999 -0.385560 0.013788 -0.418460 0.126238 -0.404314 -0.243670 -0.236473 0.199154 -0.324999 -0.361631 -0.244211 -0.195766 0.250365 0.240081 0.273592 0.242098 0.241787 0.231571 0.230889 0.271229 0.259108 0.237268 0.238687
chargesum: 0.00000
title: Mulliken charges with hydrogens summed into heavy atoms:
elementType: F O C C C C C C C C C C C C C C C C C
charge: -0.187158 -0.214851 0.371784 0.376744 0.354624 -0.268550 -0.182919 -0.111968 0.013788 -0.176362 0.126238 -0.162527 -0.012099 -0.005583 0.199154 -0.053770 -0.102523 -0.006943 0.042921
polarizability: 2.92625044e+02 1.28228323e+01 1.95547374e+02 -1.69486678e+01 4.70854475e+00 9.99058218e+01
1716.lowfreq: -8.8244 -5.1085 -0.0008 -0.0005 0.0006 6.1334 33.7765 39.6850 55.4948
frequency: 33.7492 39.6610 55.4710 97.4074 138.0929 156.3639 189.2945 225.0563 247.2290 262.2825 326.3698 354.3558 391.0468 417.1371 424.4972 478.0619 493.1494 503.2524 511.1749 522.3058 560.2556 597.2845 625.2764 632.8521 659.9572 700.8300 749.2094 759.2346 766.0843 780.2404 791.6917 793.8166 840.7300 848.2441 868.5412 884.7390 910.9824 927.8312 953.9790 962.8064 968.3435 989.5779 991.4507 997.7159 1023.4402 1033.7307 1083.6224 1121.2179 1147.9832 1157.0737 1169.6538 1174.3867 1185.2664 1220.9877 1242.2255 1260.6066 1277.7830 1301.6861 1348.9323 1377.7021 1412.3240 1424.3324 1431.9447 1435.9106 1462.3609 1466.7959 1507.3125 1540.7024 1577.9188 1582.6070 1602.7644 1613.9233 1636.5105 3122.5621 3127.5719 3130.1386 3135.2243 3142.0895 3144.8168 3154.8334 3163.6301 3165.0580 3168.5089 3179.7708
redmass: 6.4697 4.8969 5.8996 6.4108 5.5825 6.9392 4.0200 6.1536 5.7869 5.8912 9.0854 5.7133 3.2012 5.0742 3.9405 2.5239 3.7491 4.1614 6.6952 8.8512 5.1102 6.0964 6.2350 4.1009 6.2340 3.1685 1.7677 4.3424 1.3786 2.1984 4.4115 3.1028 1.9810 2.4159 1.4641 1.6650 5.0452 1.6823 1.5488 2.8810 1.4598 1.3401 1.3515 1.3722 2.2788 2.1122 2.8994 1.7806 1.8214 1.2122 1.1073 1.0827 2.5248 1.8374 1.7078 1.5283 1.8011 3.0041 1.8249 9.3430 5.4413 2.8268 2.7372 3.7014 2.5207 2.6269 3.8577 9.3481 6.7452 7.4061 5.6525 7.2439 6.7443 1.0859 1.0894 1.0890 1.0911 1.0861 1.0950 1.0907 1.1002 1.0960 1.0955 1.1000
irintensity: 3.0554 0.6713 0.5495 2.0313 0.6103 1.3636 2.8097 0.9628 4.6322 0.3159 1.5058 4.7848 0.7207 2.0300 3.6962 18.5904 8.6418 6.9781 0.0564 12.6407 0.9478 14.8082 2.9535 0.9160 7.7383 8.7411 10.2342 3.1749 131.3214 17.5608 9.2380 6.0198 23.4004 26.9773 1.2023 29.8342 35.5807 4.9464 1.8502 9.3405 8.0591 1.5436 1.5194 1.2243 5.0943 3.3387 22.2079 36.9206 17.7811 8.5492 3.5123 0.3405 32.0869 54.4800 15.0235 2.4841 7.8519 280.2666 19.4218 0.4099 13.3930 1.6639 37.6770 15.9164 50.5244 17.4307 12.5331 176.3390 10.6048 31.9327 13.9452 71.0071 24.4586 2.3824 0.2548 12.0892 4.6248 2.2210 30.6698 6.4561 33.5872 11.7844 10.5097 12.3672
temp: 298.150 k
press: 1.00000 atm
elementType: 9 8 6 6 6 6 6 6 6 6 6 6 6 6 6 6 6 6 6 1 1 1 1 1 1 1 1 1 1 1
symmnumber: 1
zpe: 591454.9 jmol-1
zpe.correction: 0.225273 hartree
zpe.thermalcorrener: 0.239856 hartree
zpe.thermalcorrenthalpy: 0.240800 hartree
zpe.thermalcorrgfe: 0.182517 hartree
zpe.sumelectzpe: -828.204509 hartree
zpe.sumelectthermal: -828.189926 hartree
zpe.sumelectthermalent: -828.188982 hartree
zpe.sumelectthermalfe: -828.247266 hartree
dipole: -0.3684 -3.2854 -1.0775
dipole: 3.4772
quadrupole: -83.4271 -106.3929 -111.9808
quadrupole: -9.9180 -4.6807 2.6821
quadrupole: 17.1732 -5.7926 -11.3805 -9.9180 -4.6807 2.6821
hfenergy: -828.4297826 hartree
pointgroup: C01 [X(C17H11F1O1)]
dipole: -0.1688917 1.3575505 -0.0013278 debye
polarizability: 288.6796304|-3.4873318|189.2416777|34.3239912|-23.8073897|110.1569313 unknown
InChI: InChI=1S/C17H11FO/c18-16-8-4-3-7-15(16)17(19)14-10-9-12-5-1-2-6-13(12)11-14/h1-11H
charge 0 multiplicity 1
30 atoms
F  1.471175 0.429961 -1.757843
O  1.54989 -2.375124 1.198119
C  -2.110746 0.574643 0.029394
C  -3.013982 -0.553196 -0.091056
C  -0.223986 -0.976214 0.376044
C  -0.720031 0.330865 0.256935
C  -2.48274 -1.882353 0.03731
C  -1.12891 -2.090708 0.27412
C  1.209108 -1.263073 0.685213
C  -2.635947 1.904981 -0.088279
C  2.280521 -0.222387 0.452622
C  -4.404226 -0.305423 -0.330128
C  -3.996722 2.116081 -0.320502
C  -4.887323 1.001644 -0.442569
C  2.407393 0.57142 -0.710191
C  3.305713 -0.091177 1.429917
C  3.460519 1.478837 -0.914669
C  4.367252 0.819834 1.263302
C  4.44368 1.609684 0.090315
H  -0.045492 1.189154 0.355268
H  -3.165556 -2.735318 -0.052728
H  -0.715862 -3.097369 0.391478
H  -1.950285 2.755883 0.002846
H  -5.087258 -1.158057 -0.423321
H  -4.389699 3.134418 -0.411189
H  -5.952773 1.18023 -0.624905
H  3.245954 -0.730034 2.316938
H  3.506134 2.050153 -1.846376
H  5.135559 0.910369 2.037584
H  5.27004 2.314275 -0.04975
