program: Gaussian 09
title: 000263271
version: EM64L-G09RevD.01
frameworkgroup: C1[X(C16H18O2)]
method: RPBEPBE
basis: SDD
operation: Freq
keyword: #pfreq=noraman
keyword: PBEPBE/SDD
title: #p freq=noraman PBEPBE/SDD
converged: YES YES NO NO
title: Mulliken charges:
elementType: O O C C C C C C C C C C C C C C C C H H H H H H H H H H H H H H H H H H
charge: -0.438487 -0.429932 -0.470024 -0.107656 0.499096 0.504265 -0.400251 -0.408330 -0.449899 -0.377481 -0.392028 -0.451974 -0.226673 -0.243162 -0.259357 -0.224552 -0.241972 -0.245115 0.237122 0.205289 0.215571 0.247573 0.239359 0.228249 0.240220 0.226724 0.233026 0.234099 0.228630 0.224286 0.227778 0.226827 0.357728 0.329992 0.231383 0.229675
chargesum: 0.00000
title: Mulliken charges with hydrogens summed into heavy atoms:
elementType: O O C C C C C C C C C C C C C C C C
charge: -0.080759 -0.099941 -0.232903 0.097634 0.499096 0.504265 0.062892 0.059279 -0.209679 -0.150757 -0.159001 -0.217875 0.001957 -0.018876 -0.031579 0.002275 -0.010589 -0.015440
polarizability: 2.00513666e+02 6.65809574e-01 1.50978685e+02 6.44992001e+00 2.57709291e+00 1.62115904e+02
1716.lowfreq: -4.8124 -0.0008 -0.0005 -0.0002 9.7494 11.9704 18.6481 43.4921 50.3838
frequency: 17.5717 43.4548 50.3129 67.2243 78.5590 99.7439 119.7194 138.1261 205.5453 221.1360 247.7625 254.8938 285.4100 291.5615 312.7865 343.9460 400.6739 406.5184 420.3681 480.3337 487.3448 560.2283 573.2188 608.6669 616.8004 629.0134 644.3063 702.3957 713.5034 753.0001 763.7552 815.0217 843.9556 848.2086 854.1166 862.1634 907.6884 917.6711 935.3074 937.8602 971.8652 972.8184 983.2667 989.8961 991.5369 994.2853 998.4470 1019.4472 1027.2858 1032.1082 1062.5026 1075.5278 1080.0425 1108.8040 1139.7154 1171.8035 1173.3802 1187.7210 1189.6693 1193.5284 1201.0992 1217.4021 1225.6647 1265.6746 1309.5084 1316.8218 1332.4667 1340.0831 1343.6305 1357.5297 1371.6011 1380.0901 1382.0076 1387.5316 1439.6501 1443.9024 1471.4127 1478.6634 1479.6410 1482.2209 1590.0957 1591.9919 1607.3850 1612.2874 2951.8259 2989.7272 2996.6310 3000.3410 3077.4307 3083.4084 3113.9265 3115.3668 3119.3819 3122.8238 3134.3145 3135.8337 3144.8276 3145.9557 3163.0536 3164.0997 3539.9483 3558.0521
redmass: 3.7377 4.6641 4.9522 4.7355 4.3915 5.0031 4.1276 2.8516 3.8163 4.8962 4.0494 4.4024 3.8449 3.7996 1.3866 2.2105 2.7506 2.3306 1.1898 3.6068 3.3936 3.6730 3.2045 5.6813 6.3877 5.3856 4.4856 1.7349 1.7325 1.9286 2.2281 3.1141 3.0513 1.2545 3.4676 1.3065 1.6296 1.4464 1.5214 2.6350 1.8930 2.3055 1.4107 6.1367 5.2497 1.3260 1.3045 2.8336 2.1884 2.2103 1.7265 1.6753 1.6399 2.3192 1.1766 1.0677 1.0613 1.3924 1.6459 1.2270 2.0159 1.5451 1.3575 1.5263 1.4169 1.3844 1.2607 1.2431 1.3126 1.3926 1.2619 1.6450 2.6431 3.7466 2.1894 2.0185 1.0871 1.1612 1.9923 2.1281 5.8440 5.9541 6.0906 6.1048 1.0807 1.0637 1.0757 1.0718 1.1015 1.1008 1.0878 1.0871 1.0860 1.0857 1.0905 1.0909 1.0957 1.0957 1.1014 1.1013 1.0660 1.0662
irintensity: 0.1467 0.6004 1.1341 0.9632 0.9075 0.8226 3.8410 4.9440 1.5011 1.9630 1.2135 0.7921 4.9170 4.8403 98.7900 61.9772 1.3494 24.0811 127.6081 3.8879 1.0900 9.2523 23.8009 3.3273 1.2330 1.8294 5.4304 37.1938 70.7323 35.9124 35.4095 3.7391 7.9398 0.0496 1.4630 0.0377 17.8153 4.3962 5.1634 66.9139 46.6390 65.9444 0.4594 0.6196 0.4087 0.2995 0.1852 20.7983 12.4537 11.1790 20.2100 2.6471 6.9515 13.3049 31.2132 0.1382 0.1707 0.1471 0.6089 0.9539 6.3195 4.4219 8.9113 0.9519 5.5276 2.1258 13.8337 5.6042 10.3787 8.1782 12.8521 1.9121 1.2351 0.1116 15.6992 0.5818 10.9625 11.1101 22.9219 11.5768 2.0235 1.6977 15.8096 2.6738 15.8825 52.2895 2.0363 60.9036 13.6076 17.8807 5.8881 8.0564 10.1960 0.8612 12.3682 11.7610 7.7332 64.9034 28.9046 18.9656 5.3349 7.4838
temp: 298.150 k
press: 1.00000 atm
elementType: 8 8 6 6 6 6 6 6 6 6 6 6 6 6 6 6 6 6 1 1 1 1 1 1 1 1 1 1 1 1 1 1 1 1 1 1
symmnumber: 1
zpe: 783606.8 jmol-1
zpe.correction: 0.298460 hartree
zpe.thermalcorrener: 0.315286 hartree
zpe.thermalcorrenthalpy: 0.316230 hartree
zpe.thermalcorrgfe: 0.252407 hartree
zpe.sumelectzpe: -769.608515 hartree
zpe.sumelectthermal: -769.591689 hartree
zpe.sumelectthermalent: -769.590745 hartree
zpe.sumelectthermalfe: -769.654568 hartree
dipole: 0.0113 -3.6710 -1.6110
dipole: 4.0089
quadrupole: -98.8486 -127.0893 -94.9406
quadrupole: 1.0912 0.8061 -5.2768
quadrupole: 8.1109 -20.1298 12.0189 1.0912 0.8061 -5.2768
hfenergy: -769.9069747 hartree
pointgroup: C01 [X(C16H18O2)]
dipole: 0.1548166 1.4552981 -0.5880531 debye
polarizability: 201.2212274|-2.6105303|151.2560906|-3.2085429|-2.5929613|161.1309374 unknown
InChI: InChI=1S/C16H18O2/c17-11-15(12-18)16(13-7-3-1-4-8-13)14-9-5-2-6-10-14/h1-10,15-18H,11-12H2
charge 0 multiplicity 1
36 atoms
O  1.315172 -2.902446 1.125619
O  -1.898664 -3.591742 -0.964098
C  -0.100718 -0.451635 0.400848
C  -0.27562 -1.760101 -0.445887
C  1.288919 0.189059 0.265448
C  -1.219429 0.566653 0.114211
C  0.923992 -2.730633 -0.284842
C  -1.578551 -2.488915 -0.039391
C  1.92503 0.715113 1.420822
C  -1.319504 1.23545 -1.133582
C  1.959315 0.311104 -0.980488
C  -2.190423 0.850396 1.108061
C  3.185343 1.348994 1.338654
C  -2.363094 2.153929 -1.381612
C  3.218884 0.943663 -1.068428
C  -3.235516 1.771094 0.866114
C  3.837733 1.467324 0.090211
C  -3.32723 2.425763 -0.382835
H  -0.213256 -0.758429 1.459612
H  -0.354313 -1.48946 -1.521926
H  1.792015 -2.398735 -0.886544
H  0.616354 -3.734065 -0.623359
H  -1.435455 -2.980963 0.938078
H  -2.42682 -1.780283 0.031836
H  1.417723 0.639896 2.391264
H  -0.570238 1.055019 -1.912739
H  1.503851 -0.097308 -1.890459
H  -2.128028 0.344428 2.079793
H  3.655057 1.748836 2.24433
H  -2.421433 2.662639 -2.350739
H  3.719432 1.025054 -2.040011
H  -3.974989 1.975462 1.648683
H  1.858832 -2.118059 1.3959
H  -2.170833 -3.204309 -1.834428
H  4.815331 1.956967 0.021362
H  -4.135466 3.140239 -0.574578
