program: Gaussian 09
title: 000263269
version: EM64L-G09RevD.01
frameworkgroup: C1[X(C16H15Cl3N4O4)]
method: RPBEPBE
basis: SDD
operation: Freq
keyword: #p
keyword: freq=noraman
keyword: PBEPBE/SDD
title: #p freq=noraman PBEPBE/SDD
converged: YES YES NO NO
title: Mulliken charges:
elementType: Cl Cl Cl O O O O N N N N C C C C C C C C C C C C C C C C H H H H H H H H H H H H H H H
charge: 0.121797 0.105094 0.092194 -0.184887 -0.272546 -0.210712 -0.205522 -0.077846 -0.427276 0.023638 0.016017 0.106464 0.520341 -0.136276 -0.646600 -0.683139 -0.498167 -0.587923 -0.381519 0.222316 -0.708222 0.300752 0.262436 -0.289480 -0.497162 0.447243 -0.367871 0.268286 0.244943 0.242164 0.242053 0.223497 0.248963 0.275406 0.243796 0.231004 0.222185 0.220826 0.364711 0.299703 0.336018 0.293303
chargesum: 0.00000
title: Mulliken charges with hydrogens summed into heavy atoms:
elementType: Cl Cl Cl O O O O N N N N C C C C C C C C C C C C C C C C
charge: 0.121797 0.105094 0.092194 -0.184887 -0.272546 -0.210712 -0.205522 -0.077846 -0.062566 0.023638 0.016017 0.106464 0.520341 0.132011 -0.646600 0.046021 -0.025708 -0.312517 -0.137723 0.222316 -0.034207 0.300752 0.262436 0.010223 -0.161144 0.447243 -0.074568
polarizability: 6.50713303e+02 -8.60032973e+00 2.81984913e+02 3.72965001e+01 1.37421182e+01 1.40636486e+02
1716.lowfreq: -4.9766 -3.1347 0.0012 0.0019 0.0024 3.1043 11.3226 19.6380 32.7751
frequency: 11.1439 19.2014 32.7386 36.5611 43.9258 58.2427 75.3210 81.2497 99.3236 125.1389 132.9407 142.4570 161.4719 173.5315 177.3347 187.8311 196.7408 213.4185 231.1891 255.6328 261.7893 273.6127 274.8512 296.1363 304.8998 312.5260 323.2135 327.2988 368.6086 375.5318 385.2248 398.5442 436.5859 444.8517 455.7568 489.9948 506.1081 513.0044 526.6604 547.4990 570.4394 611.5845 642.6924 648.7460 656.9049 669.5558 704.2457 705.0775 718.5518 722.4591 726.5400 752.4146 766.1257 774.8505 794.8588 847.8370 854.6552 863.1273 889.1389 891.8632 901.1585 917.6275 948.2898 963.3610 977.7448 983.7833 1010.2773 1039.9449 1048.2737 1053.5950 1079.1734 1085.3957 1098.6416 1108.8656 1121.9811 1136.1828 1162.2725 1181.0372 1210.4028 1232.8062 1251.2588 1269.0652 1293.0047 1301.5931 1327.6943 1346.9150 1357.9543 1370.2777 1378.5642 1394.1419 1396.5500 1403.1342 1439.8113 1448.3452 1464.7283 1476.6347 1479.0441 1481.5908 1491.7036 1508.2074 1521.8467 1583.2221 1610.1123 1620.4985 1663.4760 2983.7553 2985.6625 3003.9447 3024.6668 3082.6266 3085.2671 3105.6445 3117.0476 3127.3941 3160.0708 3167.6980 3179.9297 3188.3059 3199.2187 3199.9458
redmass: 10.2290 9.8549 11.3089 7.6162 5.0279 13.6511 11.1954 2.3546 6.2902 8.0790 7.1732 4.3368 5.5036 6.2078 11.4207 5.6584 4.1677 2.0362 2.6931 3.4372 4.4521 3.6083 2.2296 3.8005 5.5342 3.8955 5.6753 4.5185 10.5782 9.9694 4.7743 8.4837 5.0313 3.9765 3.1030 6.5441 5.8071 3.6559 4.7427 3.0802 5.4454 6.2530 7.0390 7.3367 3.3947 8.6994 7.6662 7.8041 5.5232 5.0083 6.8933 12.2458 5.9945 1.3629 1.7583 5.2813 1.2811 1.3120 3.2913 6.6163 2.7787 1.3985 1.8330 1.4080 1.3053 2.5277 1.3186 2.7274 4.1441 1.9294 2.1185 2.0198 3.9940 2.2576 2.7397 1.3602 6.0261 2.3491 5.7544 1.8148 1.3449 1.1422 1.6272 2.1020 3.8396 2.6523 2.7933 2.8636 1.4371 1.7097 1.3286 3.1092 1.1038 6.0396 1.0555 1.0925 2.4240 1.1507 1.0885 4.3292 3.4202 4.1802 7.5282 7.3650 6.9117 1.0606 1.0360 1.0344 1.0965 1.1004 1.0993 1.1008 1.1002 1.0871 1.0957 1.0903 1.0893 1.0919 1.0817 1.0934
irintensity: 0.2264 0.8202 0.2223 0.6059 0.1942 0.1618 0.5280 0.3545 3.6304 0.7021 0.1316 1.9134 2.1736 2.0895 6.7061 0.0289 0.9612 1.6205 1.0506 2.4125 1.1879 1.9045 1.9351 4.3320 2.2555 0.2690 0.4830 3.6221 1.7043 5.7824 3.2407 1.8344 3.9232 1.7558 2.3343 17.7329 9.7613 11.5297 23.9335 6.1360 23.0337 6.3287 2.5649 7.8032 39.9574 21.9006 99.2001 12.7894 39.1711 2.1447 91.7409 10.6866 27.6298 9.3695 22.6680 2.4940 135.3495 0.2566 37.7426 2.2807 85.2829 23.8957 29.3044 24.8861 6.4168 4.3235 0.1045 23.3283 40.0004 34.6772 18.7035 26.2594 57.3501 44.6587 4.9557 69.0067 275.3930 51.9963 717.7650 176.8040 1.5139 1.0959 4.7632 49.0404 295.4354 114.5500 83.0190 21.4540 19.1273 10.3711 14.5716 6.4144 24.4393 1.7305 10.0122 9.6403 38.3917 35.5958 32.8918 148.1000 6.6529 161.6905 67.3860 529.4230 116.8538 7.6940 22.1535 12.2588 9.1957 35.7109 36.2113 14.1411 11.0942 1.2781 7.2625 3.3625 3.8087 20.2994 41.7475 13.8369
temp: 298.150 k
press: 1.00000 atm
elementType: 17 17 17 8 8 8 8 7 7 7 7 6 6 6 6 6 6 6 6 6 6 6 6 6 6 6 6 1 1 1 1 1 1 1 1 1 1 1 1 1 1 1
symmnumber: 1
zpe: 770641.1 jmol-1
zpe.correction: 0.293522 hartree
zpe.thermalcorrener: 0.319795 hartree
zpe.thermalcorrenthalpy: 0.320739 hartree
zpe.thermalcorrgfe: 0.234096 hartree
zpe.sumelectzpe: -2516.601840 hartree
zpe.sumelectthermal: -2516.575567 hartree
zpe.sumelectthermalent: -2516.574623 hartree
zpe.sumelectthermalfe: -2516.661266 hartree
dipole: -8.3787 3.0505 -2.5176
dipole: 9.2654
quadrupole: -240.5447 -184.1927 -176.2912
quadrupole: -3.3708 7.2088 -0.6796
quadrupole: -40.2019 16.1502 24.0517 -3.3708 7.2088 -0.6796
hfenergy: -2516.8953621 hartree
pointgroup: C01 [X(C16H15Cl3N4O4)]
dipole: -3.3442467 -1.1732781 0.8529411 debye
polarizability: 651.8994332|-0.0247007|278.7112518|-29.2563104|25.4436017|142.7240168 unknown
InChI: InChI=1S/C16H15Cl3N4O4/c1-3-10-8-11(6-7-15(10,2)16(17,18)19)20-21-13-5-4-12(22(24)25)9-14(13)23(26)27/h4-9,21H,3H2,1-2H3
charge 0 multiplicity 1
42 atoms
Cl -4.324641 0.599998 -2.324638
Cl -6.79449 -0.147997 -0.740265
Cl -5.61473 2.570059 -0.426147
O  4.035563 3.197065 0.463544
O  1.808682 2.719775 0.520651
O  6.730135 -2.328738 -0.820896
O  7.350271 -0.160186 -0.44741
N  0.0096 -0.680583 0.015364
N  0.984143 0.291912 0.118869
N  3.067396 2.3560 0.363294
N  6.459352 -1.089754 -0.560931
C  -4.189518 0.242096 0.491925
C  -3.615842 -1.168171 0.184992
C  -3.082847 1.285916 0.653158
C  -5.148524 0.755064 -0.661477
C  -4.974362 0.22737 1.848768
C  -4.566394 -2.35234 0.051912
C  -2.261318 -1.352257 0.078328
C  -1.748562 1.043861 0.531432
C  -1.264458 -0.297725 0.199918
C  -3.911569 -3.749473 0.046015
C  2.311791 -0.03992 -0.045437
C  3.355363 0.954872 0.067745
C  2.702289 -1.388505 -0.334637
C  4.713318 0.606179 -0.101791
C  5.042667 -0.723872 -0.383877
C  4.040715 -1.729879 -0.502709
H  -3.424017 2.288845 0.929049
H  -4.286722 -0.097393 2.647557
H  -5.348479 1.23618 2.093622
H  -5.833129 -0.461248 1.81483
H  -5.315501 -2.312993 0.866213
H  -5.155232 -2.237711 -0.879343
H  -1.857947 -2.351838 -0.105201
H  -1.054352 1.873099 0.709671
H  -4.696742 -4.525101 0.00714
H  -3.30759 -3.923653 0.955038
H  -3.260713 -3.897159 -0.834599
H  0.815873 1.302011 0.312281
H  1.908029 -2.132257 -0.418716
H  5.489646 1.370199 -0.01179
H  4.345348 -2.755748 -0.725251
