program: Gaussian 09
title: 000263265
version: EM64L-G09RevD.01
frameworkgroup: C1[X(C21H16)]
method: RPBEPBE
basis: SDD
operation: Freq
keyword: #p
keyword: freq=noraman
keyword: PBEPBE/SDD
title: #p freq=noraman PBEPBE/SDD
converged: YES YES NO NO
title: Mulliken charges:
elementType: C C C C C C C C C C C C C C C C C C C C C H H H H H H H H H H H H H H H H
charge: -0.220833 -0.563161 0.021490 -0.260020 0.409133 0.356880 0.640697 0.293111 -0.725764 -0.742861 -0.471887 0.119965 -0.492947 -0.476494 -0.222025 0.424651 -0.489153 -0.339733 -0.441591 -0.263353 -0.253026 0.236083 0.233367 0.233184 0.218521 0.227783 0.219945 0.231095 0.240902 0.242819 0.245215 0.218288 0.232745 0.221529 0.240104 0.226673 0.228671
chargesum: 0.00000
title: Mulliken charges with hydrogens summed into heavy atoms:
elementType: C C C C C C C C C C C C C C C C C C C C C
charge: 0.015250 -0.096610 0.021490 -0.260020 0.409133 0.356880 0.640697 0.293111 -0.059516 -0.511766 -0.230986 0.119965 -0.250128 -0.231279 -0.003737 0.424651 -0.256408 -0.118204 -0.201487 -0.036680 -0.024355
polarizability: 4.15613638e+02 1.54731067e+01 2.49601557e+02 -5.32766358e+00 4.82687207e+00 9.81233117e+01
1716.lowfreq: -6.2176 -2.9185 -0.0003 -0.0002 0.0003 8.2258 33.8009 65.3432 71.4983
frequency: 33.7949 65.3422 71.4960 137.8410 147.3352 172.2418 201.5151 235.3958 256.7637 269.4895 285.8175 303.7251 346.4971 387.2002 414.0082 438.1230 464.2818 490.0056 506.0954 515.7797 548.7109 561.1642 564.6171 570.5000 581.1018 632.4092 638.2316 664.8108 707.8392 736.6758 751.6170 758.3688 769.8837 803.4050 815.2146 836.8106 842.5594 860.2357 874.9815 883.7457 892.1986 905.5147 929.1749 946.2801 954.6028 976.8432 980.7777 982.0646 990.6012 1028.4848 1036.7934 1043.0973 1062.8025 1090.1977 1095.2579 1128.9297 1158.0599 1177.1498 1178.5524 1183.1549 1209.1708 1223.7549 1232.1365 1245.9357 1254.0321 1272.0720 1281.6469 1297.7404 1323.1521 1347.6200 1380.2598 1388.1517 1395.4195 1404.6034 1408.3289 1442.4941 1451.2467 1454.3102 1471.0738 1474.5103 1477.1738 1487.2827 1503.3132 1553.7900 1584.9907 1604.3544 1616.7893 1624.5086 1630.7728 2974.2264 2974.9338 2981.3693 3026.7969 3071.1333 3077.9021 3118.3141 3118.7209 3120.5463 3131.1539 3132.0566 3143.7645 3145.5438 3151.5574 3152.9829 3166.2706
redmass: 3.1761 4.1523 3.7981 3.8337 4.3165 3.0462 4.1371 1.6359 1.6062 4.3997 3.7103 3.9643 5.3738 3.0237 3.0472 4.3976 3.3559 4.2366 5.5052 3.4075 5.4549 4.0296 3.3801 5.8869 3.3736 3.7288 6.2223 5.5926 2.9206 4.6853 5.0948 1.3115 1.4503 1.8096 2.7351 1.7373 4.4064 3.8435 3.2683 1.4972 1.6937 1.5593 2.1515 3.4453 1.3869 1.3771 1.4068 2.9841 1.3696 2.9083 2.2415 2.2006 2.0631 2.2118 1.9432 2.0524 1.3792 1.2229 1.0880 1.3479 1.7800 1.2960 1.7936 1.6083 1.8605 1.5313 1.7405 1.6178 2.9889 4.1136 3.8914 1.2297 2.3634 4.1241 2.5195 2.9281 2.8577 1.2213 3.8845 1.0501 1.0749 4.0371 3.5749 5.8401 8.0868 6.5523 6.3511 7.0464 7.7989 1.0535 1.0508 1.0753 1.1005 1.0998 1.1004 1.0864 1.0857 1.0860 1.0919 1.0886 1.0919 1.0977 1.0981 1.0929 1.0981
irintensity: 0.1153 0.2868 0.7495 0.0758 0.9252 3.6384 0.3792 0.6063 1.3767 0.6398 2.0808 0.3348 0.0184 1.5771 3.3140 2.6965 4.6546 2.1268 1.4543 1.7094 3.9720 0.4931 4.1061 0.9248 1.3811 1.1735 6.0175 0.8867 10.3273 1.0931 4.7636 54.4264 25.1168 0.4571 23.1941 68.0585 2.8292 2.7323 1.4309 0.9570 17.5176 2.6479 14.4744 0.2005 3.9651 2.8708 1.2220 5.3941 0.4485 3.6313 2.8767 7.9503 1.4435 2.2672 2.8441 4.2923 0.2864 3.0435 1.0471 0.4251 1.8431 0.7239 3.3701 7.0183 3.1271 2.9385 1.6184 4.5988 0.2400 10.4952 14.4497 10.4557 2.4417 1.7710 2.8112 7.2517 2.3521 2.7228 1.9661 11.5639 4.5583 6.1972 17.9989 2.9465 19.3099 2.7934 5.9980 6.3206 11.4002 14.2428 39.8139 34.8281 19.7194 28.3558 42.1716 0.1109 1.7433 5.1530 16.7416 10.8364 10.9911 31.9748 29.6272 46.5198 37.6452
temp: 298.150 k
press: 1.00000 atm
elementType: 6 6 6 6 6 6 6 6 6 6 6 6 6 6 6 6 6 6 6 6 6 1 1 1 1 1 1 1 1 1 1 1 1 1 1 1 1
symmnumber: 1
zpe: 786030.7 jmol-1
zpe.correction: 0.299383 hartree
zpe.thermalcorrener: 0.314793 hartree
zpe.thermalcorrenthalpy: 0.315737 hartree
zpe.thermalcorrgfe: 0.256914 hartree
zpe.sumelectzpe: -808.469220 hartree
zpe.sumelectthermal: -808.453810 hartree
zpe.sumelectthermalent: -808.452866 hartree
zpe.sumelectthermalfe: -808.511689 hartree
dipole: 0.7423 -0.8185 -0.0526
dipole: 1.1063
quadrupole: -104.9461 -106.6459 -129.7188
quadrupole: -2.4770 -1.1290 1.4530
quadrupole: 8.8242 7.1244 -15.9485 -2.4770 -1.1290 1.4530
hfenergy: -808.7686032 hartree
pointgroup: C01 [X(C21H16)]
dipole: -0.2824696 -0.3306333 0.0179174 debye
polarizability: 416.4454944|-10.4613461|248.8494846|-2.9252214|-4.7209351|98.0435275 unknown
InChI: InChI=1S/C21H16/c1-13-11-20-18-10-9-14-5-2-3-7-17(14)19(18)12-15-6-4-8-16(13)21(15)20/h2-10,12-13H,11H2,1H3
charge 0 multiplicity 1
37 atoms
C  -3.569214 -1.513488 0.239161
C  -2.127852 -2.169559 0.212624
C  -1.152168 -0.99789 0.138165
C  -1.886252 0.205857 0.095907
C  -3.297148 -0.007056 0.145934
C  0.259835 -0.958482 0.097581
C  -1.274833 1.498171 0.009518
C  0.922597 0.347279 0.015172
C  -4.491051 -2.037333 -0.889005
C  0.147248 1.534272 -0.027977
C  -4.142429 1.099644 0.106127
C  2.397359 0.378034 -0.022788
C  -2.172557 2.623045 -0.028648
C  1.053983 -2.168874 0.134694
C  -3.557113 2.41661 0.017518
C  3.136328 -0.859789 0.018032
C  2.430881 -2.124107 0.096391
C  3.143264 1.592988 -0.098826
C  4.563476 -0.838498 -0.018597
C  4.546509 1.595365 -0.133778
C  5.267818 0.370354 -0.093561
H  -4.054655 -1.737559 1.210343
H  -1.953875 -2.795263 1.109061
H  -2.024598 -2.838779 -0.664575
H  -4.65295 -3.126982 -0.791304
H  -4.043675 -1.840807 -1.880714
H  -5.479551 -1.543151 -0.858916
H  0.63808 2.510571 -0.091968
H  -5.233225 0.997681 0.141649
H  -1.769341 3.640514 -0.094082
H  0.531228 -3.130049 0.194865
H  -4.227774 3.283522 -0.012324
H  3.022586 -3.046929 0.125259
H  2.621393 2.553885 -0.131246
H  5.104434 -1.79199 0.013669
H  5.087868 2.54617 -0.192356
H  6.362877 0.375024 -0.120806
