program: Gaussian 09
title: 000263261
version: EM64L-G09RevD.01
frameworkgroup: C1[X(C15H18O5)]
method: RPBEPBE
basis: SDD
operation: Freq
keyword: #pfreq=noraman
keyword: PBEPBE/SDD
title: #p freq=noraman PBEPBE/SDD
converged: YES YES NO NO
title: Mulliken charges:
elementType: O O O O O C C C C C C C C C C C C C C C H H H H H H H H H H H H H H H H H H
charge: -0.273363 -0.276735 -0.252420 -0.252869 -0.209979 0.290059 0.200697 -0.339484 0.169037 -0.301641 -0.376141 -0.278534 -0.230171 0.165079 0.091914 -0.258506 -0.257303 -0.666902 -0.671266 -0.534165 0.295736 0.257597 0.243101 0.231530 0.228969 0.233433 0.220194 0.224605 0.236025 0.231503 0.252087 0.213975 0.223379 0.250170 0.219619 0.251834 0.223763 0.225174
chargesum: 0.00000
title: Mulliken charges with hydrogens summed into heavy atoms:
elementType: O O O O O C C C C C C C C C C C C C C C
charge: -0.273363 -0.276735 -0.252420 -0.252869 -0.209979 0.290059 0.200697 -0.043748 0.169037 -0.044044 -0.133041 -0.047004 -0.001202 0.165079 0.091914 0.195121 0.203327 0.030664 0.021901 0.166607
polarizability: 2.85488168e+02 8.02059594e+00 2.09252816e+02 5.51749266e+00 1.69770497e+00 1.08857788e+02
1716.lowfreq: -4.8531 0.0008 0.0009 0.0010 3.2246 6.2082 15.9635 33.3856 43.8521
frequency: 15.6719 33.3231 43.8218 47.8478 60.6284 78.8887 85.4662 89.8842 97.2982 106.5023 140.8525 157.3908 157.9119 206.8980 216.7122 219.1549 238.3022 259.5094 282.9095 301.8527 309.0511 327.8548 351.8344 421.8021 435.9789 452.5275 471.9654 524.5379 536.5051 575.9323 577.7528 599.7412 662.3604 707.5733 737.5021 742.2504 749.8926 757.5218 772.2009 797.4640 816.9825 820.1217 834.9191 853.6125 873.5519 939.5381 972.4896 978.2247 982.3166 987.8624 1013.5691 1026.7058 1049.1906 1094.9548 1095.6842 1103.2608 1112.4523 1133.1407 1151.2529 1155.9492 1156.4523 1178.1914 1193.0287 1218.2368 1247.2047 1278.5645 1279.4385 1305.3518 1344.8501 1354.1342 1362.1560 1389.5496 1392.1223 1393.9796 1430.5437 1449.9078 1456.4344 1457.7668 1462.2918 1466.6281 1467.8126 1470.3990 1484.1827 1485.5767 1488.8588 1578.4851 1593.8767 1606.8349 1621.3479 1640.1169 2965.8900 2990.0041 2992.8797 3027.9405 3030.3212 3056.9864 3083.8977 3088.2383 3090.9840 3093.3554 3117.6341 3119.2609 3123.6082 3131.0200 3134.7668 3153.6486 3168.5406 3179.5800
redmass: 4.5013 4.5832 4.3793 3.4915 3.9095 2.9729 6.7512 3.8403 3.5063 3.8616 4.0171 4.5344 3.9712 1.7393 2.2779 1.8590 1.3862 1.6436 3.3087 2.5433 2.9715 3.8638 4.6460 3.9179 4.4592 4.9098 3.3763 4.7873 4.2900 4.7223 5.5451 6.4575 5.4821 5.3782 5.2410 3.7905 3.2227 1.3079 3.0792 3.0442 1.5546 1.6531 3.2299 1.5301 3.5517 1.3802 1.5604 1.4441 2.5796 8.0265 2.8534 4.4873 2.1743 2.1542 2.1427 2.7054 1.2596 4.1253 1.3905 1.6741 1.6899 1.1205 2.0327 3.0745 3.0369 1.1164 1.1175 1.6267 1.6095 1.2789 1.8519 1.2326 1.2658 2.9330 1.3943 1.7958 1.1016 1.1015 1.0448 1.0542 1.2341 1.0536 1.4679 1.0626 1.2000 6.5217 9.1146 6.1936 9.4459 9.7575 1.0327 1.0359 1.0363 1.0595 1.0595 1.1043 1.0975 1.0972 1.1027 1.1035 1.1068 1.1054 1.0878 1.0995 1.0864 1.0907 1.0944 1.0975
irintensity: 0.7628 2.1220 1.7839 2.0763 0.4268 0.0096 0.1818 0.8826 3.7102 1.8240 0.4217 1.9669 1.4208 3.2058 1.8249 1.2610 2.0714 1.4116 6.3242 6.3104 8.3435 12.3542 4.9368 6.2976 0.8618 7.1948 10.7792 2.4280 6.6343 1.0658 16.7091 2.3035 15.4113 1.1531 5.5717 1.6718 15.2169 84.1580 22.5618 1.5268 0.6800 1.7151 3.6878 2.8500 22.0730 1.3585 14.9297 2.9632 18.8119 44.6566 45.7428 205.0965 27.9978 12.9951 66.2043 59.7128 0.1606 591.4101 11.7003 44.0390 71.5420 24.6936 226.7695 185.1327 97.0520 6.1819 3.7157 6.0392 16.4680 1.6582 18.6177 24.7879 18.4081 73.3920 24.3562 21.2300 22.7254 17.7724 13.5418 20.2892 69.1001 14.6763 12.1837 18.5758 6.2806 11.7776 330.1737 40.8444 99.1955 171.7317 76.4116 15.8954 24.3502 34.8620 33.3597 42.0119 44.6958 41.8720 3.1931 0.2172 31.3589 32.7736 2.0806 16.9145 1.0869 14.8750 20.3908 10.5029
temp: 298.150 k
press: 1.00000 atm
elementType: 8 8 8 8 8 6 6 6 6 6 6 6 6 6 6 6 6 6 6 6 1 1 1 1 1 1 1 1 1 1 1 1 1 1 1 1 1 1
symmnumber: 1
zpe: 790442.9 jmol-1
zpe.correction: 0.301064 hartree
zpe.thermalcorrener: 0.322280 hartree
zpe.thermalcorrenthalpy: 0.323224 hartree
zpe.thermalcorrgfe: 0.248482 hartree
zpe.sumelectzpe: -956.995703 hartree
zpe.sumelectthermal: -956.974487 hartree
zpe.sumelectthermalent: -956.973543 hartree
zpe.sumelectthermalfe: -957.048284 hartree
dipole: 2.2542 1.0897 -0.5730
dipole: 2.5685
quadrupole: -80.6768 -102.4397 -127.1017
quadrupole: -8.7113 2.4216 -5.6926
quadrupole: 22.7293 0.9664 -23.6956 -8.7113 2.4216 -5.6926
hfenergy: -957.2967664 hartree
pointgroup: C01 [X(C15H18O5)]
dipole: 0.8645973 -0.3655469 0.3741639 debye
polarizability: 285.1600877|-6.2934874|206.1111551|10.6675944|-17.5099096|112.3275282 unknown
InChI: InChI=1S/C15H18O5/c1-4-19-14(16)12(15(17)20-5-2)10-11-8-6-7-9-13(11)18-3/h6-10H,4-5H2,1-3H3
charge 0 multiplicity 1
38 atoms
O  2.429582 2.279429 -0.322817
O  -3.495586 0.723155 -0.376764
O  -1.964035 -1.690101 0.771752
O  -2.197186 2.605525 0.116024
O  -1.451309 -1.59185 -1.504259
C  1.383795 0.174121 0.160338
C  2.597036 0.921802 -0.031086
C  0.108319 0.886062 0.07654
C  -1.162093 0.392163 -0.090687
C  1.505495 -1.210478 0.464734
C  3.86216 0.295332 0.061075
C  2.761962 -1.839022 0.557532
C  3.939303 -1.084389 0.350267
C  -2.286921 1.369904 -0.096071
C  -1.518094 -1.041111 -0.381831
C  -4.711815 1.58683 -0.446151
C  -2.487719 -3.081664 0.592419
C  -4.860225 2.205396 -1.839381
C  -1.358679 -4.112295 0.686514
C  3.62593 3.106548 -0.502687
H  0.172279 1.97996 0.149709
H  0.601397 -1.78939 0.669839
H  4.781871 0.866562 -0.092571
H  2.825537 -2.904813 0.798852
H  4.921133 -1.565767 0.419313
H  -4.633398 2.365152 0.333313
H  -5.534488 0.89261 -0.211053
H  -3.214388 -3.187981 1.413667
H  -3.001332 -3.137235 -0.383241
H  -4.863735 1.422794 -2.617423
H  -4.036961 2.909739 -2.044253
H  -5.814697 2.760925 -1.900738
H  -0.804691 -4.004832 1.635724
H  -0.657705 -4.005482 -0.158717
H  -1.783667 -5.132786 0.652673
H  3.243146 4.118927 -0.695873
H  4.253364 3.110532 0.409346
H  4.223217 2.761226 -1.368128
