program: Gaussian 09
title: 000263256
version: EM64L-G09RevD.01
frameworkgroup: C1[X(C15H13NO)]
method: RPBEPBE
basis: SDD
operation: Freq
keyword: #p
keyword: freq=noraman
keyword: PBEPBE/SDD
title: #p freq=noraman PBEPBE/SDD
converged: YES YES NO YES
title: Mulliken charges:
elementType: O N C C C C C C C C C C C C C C C H H H H H H H H H H H H H
charge: -0.271465 -0.705463 0.186725 0.248546 0.548787 0.255335 0.346059 -0.821761 -0.517941 -0.387126 -0.486604 -0.368849 0.314368 -0.385219 -0.267679 -0.272956 -0.536757 0.222778 0.245728 0.229387 0.237758 0.194909 0.239552 0.228075 0.226936 0.310006 0.308354 0.217908 0.217904 0.242703
chargesum: 0.00000
title: Mulliken charges with hydrogens summed into heavy atoms:
elementType: O N C C C C C C C C C C C C C C C
charge: -0.271465 -0.087103 0.186725 0.248546 0.548787 0.255335 0.346059 -0.598983 -0.272213 -0.157739 -0.248846 -0.173939 0.314368 -0.145666 -0.039604 -0.046020 0.141759
polarizability: 3.03954154e+02 1.10038862e+01 2.00459110e+02 2.11685454e-02 4.49665444e-03 7.22222908e+01
1716.lowfreq: -9.8727 -0.0009 -0.0007 0.0002 5.1019 7.6385 56.0489 58.4758 88.5389
frequency: 56.0289 58.4514 88.5364 136.1312 153.6833 193.3937 219.9678 251.4086 256.5543 262.5884 315.3988 335.7800 373.5592 397.9793 408.2895 427.3478 445.9535 491.5474 508.7400 513.8678 530.9161 604.0999 611.3104 627.5606 633.0435 700.4458 732.4291 735.5871 767.6578 791.9524 803.1091 820.7821 859.7104 877.7874 878.4375 906.5903 943.8271 947.5692 983.1516 991.8885 1022.8905 1035.1285 1047.5745 1106.5320 1112.0833 1128.7716 1152.7443 1162.6749 1184.3236 1195.6745 1220.1623 1253.0772 1276.2937 1304.9824 1330.9014 1385.8609 1397.8879 1422.2295 1433.8004 1436.7126 1452.1306 1461.4255 1467.3475 1475.8896 1512.2557 1531.2843 1574.0721 1610.7884 1623.3680 1635.0860 1646.4481 2953.4062 3038.6003 3110.2653 3119.2523 3121.2034 3124.1470 3134.9869 3150.8249 3161.0185 3163.5313 3170.7233 3581.0002 3720.6961
redmass: 3.4910 2.7741 3.3370 3.4401 4.2984 2.4063 1.5366 3.8158 1.3351 3.7932 3.6519 5.7567 1.4909 2.7197 6.0874 2.4989 3.2961 6.2977 4.7255 2.6894 4.0945 5.1182 3.2737 6.1379 3.0436 5.8992 2.3807 5.9800 1.7706 1.6323 1.4968 4.5039 1.5245 5.1913 1.5722 2.5970 1.4003 1.5555 1.3505 8.7488 2.6882 1.8222 2.7516 2.2154 1.2582 1.8917 1.5721 1.3864 1.1215 2.1091 1.4773 1.6419 1.8013 2.1752 2.6278 4.2026 4.2931 3.1487 1.5625 2.9902 2.4052 2.8594 1.0503 1.0891 3.4401 4.1140 7.8226 4.6174 5.5978 3.4368 1.5715 1.0331 1.1037 1.0909 1.0985 1.0847 1.0887 1.0885 1.0940 1.0942 1.0963 1.0933 1.0456 1.1025
irintensity: 7.4568 1.2494 15.1479 11.7576 2.2573 7.4991 64.4605 6.2334 3.4565 2.3166 2.2736 1.3061 118.8226 47.3663 1.8938 0.1571 12.6577 2.6131 2.3288 2.3388 4.9260 20.4110 19.4158 3.3605 2.9719 2.4900 35.9508 4.2784 55.6590 10.9189 11.5837 1.2460 18.4181 9.5664 58.5156 5.4550 0.2897 12.0951 0.3200 62.4558 28.4786 1.1065 8.8669 5.5614 0.2467 9.2843 5.5681 54.6842 2.6408 182.2876 13.2987 2.7132 85.0085 28.3355 70.6148 14.2682 27.0784 17.9064 8.3671 5.2757 15.7263 19.6972 12.3452 60.0361 146.6647 8.2123 1.7340 92.8946 31.2231 26.2081 310.8292 103.4223 54.3910 21.6192 34.1958 7.6761 15.5904 15.8542 30.2323 14.2739 26.2111 19.5675 71.5912 20.8872
temp: 298.150 k
press: 1.00000 atm
elementType: 8 7 6 6 6 6 6 6 6 6 6 6 6 6 6 6 6 1 1 1 1 1 1 1 1 1 1 1 1 1
symmnumber: 1
zpe: 626802.1 jmol-1
zpe.correction: 0.238736 hartree
zpe.thermalcorrener: 0.252962 hartree
zpe.thermalcorrenthalpy: 0.253906 hartree
zpe.thermalcorrgfe: 0.198039 hartree
zpe.sumelectzpe: -708.208393 hartree
zpe.sumelectthermal: -708.194167 hartree
zpe.sumelectthermalent: -708.193223 hartree
zpe.sumelectthermalfe: -708.249090 hartree
dipole: -0.6497 2.1827 -0.0038
dipole: 2.2774
quadrupole: -68.6755 -84.8157 -107.4442
quadrupole: -1.4696 0.0222 -0.0102
quadrupole: 18.3029 2.1628 -20.4657 -1.4696 0.0222 -0.0102
hfenergy: -708.447129 hartree
pointgroup: C01 [X(C15H13N1O1)]
dipole: -0.2120527 0.8705363 -0.0014758 debye
polarizability: 304.7983206|5.7450704|199.6149433|0.0213681|0.0034254|72.2222908 unknown
InChI: InChI=1S/C15H13NO/c1-17-11-7-6-10-8-15(16)13-5-3-2-4-12(13)14(10)9-11/h2-9H,16H2,1H3
charge 0 multiplicity 1
30 atoms
O  3.87268 -1.34626 0.000124
N  -2.954527 2.621848 0.000016
C  0.380409 -0.100813 0.000053
C  -0.991646 -0.620594 -0.000062
C  0.568865 1.330755 0.000031
C  -2.114243 0.288685 -0.000121
C  -1.875226 1.734099 -0.000075
C  -0.56619 2.211425 -0.000193
C  1.52766 -0.940647 0.000086
C  -1.262801 -2.023195 -0.000165
C  1.8992 1.849845 0.000109
C  -3.439333 -0.248435 -0.000379
C  2.825499 -0.402219 0.000174
C  3.020158 1.010205 0.000213
C  -2.570095 -2.526423 -0.000404
C  -3.672638 -1.629473 -0.00053
C  5.24261 -0.83441 0.000519
H  -0.383766 3.293887 -0.000544
H  1.442544 -2.030352 -0.000039
H  -0.429754 -2.732099 -0.000062
H  2.039831 2.937231 0.0001
H  -4.310145 0.416857 -0.000361
H  4.025138 1.44244 0.00029
H  -2.741759 -3.608222 -0.000439
H  -4.69795 -2.014978 -0.000762
H  -2.784045 3.622919 -0.000176
H  -3.916269 2.303734 -0.002058
H  5.450428 -0.229202 0.905162
H  5.450911 -0.229094 -0.903941
H  5.883351 -1.728816 0.000636
