program: Gaussian 09
title: 000263254
version: EM64L-G09RevD.01
frameworkgroup: C1[X(C15H11NO3)]
method: RPBEPBE
basis: SDD
operation: Freq
keyword: #p
keyword: freq=noraman
keyword: PBEPBE/SDD
title: #p freq=noraman PBEPBE/SDD
converged: NO NO NO NO
title: Mulliken charges:
elementType: O O O N C C C C C C C C C C C C C C C H H H H H H H H H H H
charge: -0.257793 -0.217842 -0.223071 0.015483 0.185716 0.289105 0.278828 0.527512 0.202138 -0.759189 -0.501984 -0.387978 -0.449016 -0.381417 0.326154 -0.380649 -0.261973 -0.243526 -0.534969 0.296567 0.255201 0.230184 0.256784 0.308216 0.251989 0.233710 0.235681 0.226908 0.226908 0.252324
chargesum: 0.00000
title: Mulliken charges with hydrogens summed into heavy atoms:
elementType: O O O N C C C C C C C C C C C C C C C
charge: -0.257793 -0.217842 -0.223071 0.015483 0.185716 0.289105 0.278828 0.527512 0.202138 -0.462622 -0.246783 -0.157794 -0.192233 -0.073201 0.326154 -0.128660 -0.028262 -0.007846 0.171171
polarizability: 3.42042619e+02 -1.23003512e+01 2.24717985e+02 4.05655530e-02 -3.80432166e-02 7.22552461e+01
1716.lowfreq: -12.8875 -8.3735 -0.0009 -0.0007 0.0003 7.0477 7.1319 47.3866 72.9225
frequency: -10.3277 47.3426 72.8958 100.6494 128.4081 142.6656 186.7814 228.7608 230.7228 250.8359 261.6937 289.3497 353.0498 378.7270 398.2055 422.9776 431.1446 436.5168 499.5225 509.4110 552.6613 562.9909 599.0301 624.9367 628.5018 689.0697 703.2775 714.1977 745.2969 747.3410 769.8577 801.0601 805.4603 824.1974 881.2469 890.8836 899.4822 943.1411 955.0406 973.6903 981.4744 986.1107 1007.4761 1022.9866 1052.9885 1106.8046 1110.3041 1145.0011 1158.6193 1175.2752 1179.8618 1189.0266 1207.4383 1245.6790 1265.2953 1282.0289 1308.4444 1340.4217 1369.2079 1399.7092 1412.3118 1428.0440 1439.2377 1448.2344 1454.3624 1467.8754 1470.6023 1511.4084 1523.1029 1568.6630 1602.2482 1618.7868 1630.3419 2969.0031 3061.6414 3132.8022 3135.9439 3138.0569 3152.6244 3164.6026 3168.4798 3171.6317 3180.2296 3216.1583
redmass: 14.5484 5.2447 3.6878 3.6671 4.6957 4.8603 1.9134 7.7487 1.7319 3.8885 3.8136 9.8079 5.9997 8.0737 7.2246 3.2367 6.2859 3.1865 5.6881 2.8401 5.2392 4.2765 6.9358 6.8453 3.4579 6.4380 6.5182 8.4854 6.3220 2.8395 1.7770 1.5734 6.0019 1.7322 6.2872 1.4491 2.1914 1.3464 6.3866 1.3819 1.5400 8.9431 1.3346 2.8833 2.1448 2.3273 1.2562 1.3943 1.5228 2.1781 1.8798 1.4104 2.4612 1.8003 2.3936 1.6481 2.1671 5.9597 5.4699 3.1913 3.8458 1.8818 1.9890 2.4578 3.1866 1.0500 1.0756 3.6448 4.3647 7.3476 6.8590 6.4299 6.7536 1.0326 1.1045 1.0997 1.0861 1.0897 1.0916 1.0913 1.0981 1.0954 1.0903 1.0930
irintensity: 0.0702 0.4056 7.5277 2.0110 0.4892 1.6355 0.0138 3.3482 0.0732 0.7343 3.4988 0.2911 3.1274 1.9570 0.6454 6.7672 1.1076 4.6765 1.4442 2.5997 33.7391 6.6492 0.8611 3.4404 8.4878 0.2511 0.9427 6.5336 1.9846 18.0657 54.7945 1.7053 17.5564 55.0528 0.6879 9.9567 10.7261 8.6232 50.7442 1.1300 22.6000 53.3610 1.3032 16.8780 10.0926 0.8608 0.1257 31.6265 355.6313 357.8764 149.4455 90.3320 83.8813 5.8588 10.9228 69.9368 10.9801 108.2483 10.6665 27.6978 0.7719 63.5157 6.3735 0.9002 37.5756 15.0237 42.5043 60.5685 77.6697 11.5420 0.8699 54.4905 277.7158 89.0255 41.2261 22.4868 3.3218 3.0734 16.4303 2.8139 15.6172 14.6737 9.2623 12.1268
temp: 298.150 k
press: 1.00000 atm
elementType: 8 8 8 7 6 6 6 6 6 6 6 6 6 6 6 6 6 6 6 1 1 1 1 1 1 1 1 1 1 1
symmnumber: 1
zpe: 587854.3 jmol-1
zpe.correction: 0.223902 hartree
zpe.thermalcorrener: 0.238159 hartree
zpe.thermalcorrenthalpy: 0.239103 hartree
zpe.thermalcorrgfe: 0.182656 hartree
zpe.sumelectzpe: -857.233667 hartree
zpe.sumelectthermal: -857.219410 hartree
zpe.sumelectthermalent: -857.218465 hartree
zpe.sumelectthermalfe: -857.274912 hartree
dipole: 7.5408 1.8360 0.0014
dipole: 7.7611
quadrupole: -100.7907 -104.1276 -113.3500
quadrupole: -21.6222 -0.0142 0.0165
quadrupole: 5.2987 1.9618 -7.2605 -21.6222 -0.0142 0.0165
hfenergy: -857.4575684 hartree
pointgroup: C01 [X(C15H11N1O3)]
dipole: 2.9351509 -0.8416531 -0.0005664 debye
polarizability: 342.8444754|7.5218488|223.9161294|-0.0420701|-0.0363725|72.2552461 unknown
InChI: InChI=1S/C15H11NO3/c1-19-11-7-6-10-8-15(16(17)18)13-5-3-2-4-12(13)14(10)9-11/h2-9H,1H3
charge 0 multiplicity 1
30 atoms
O  4.43336 -0.821179 0.000022
O  -2.852074 3.18386 -0.004088
O  -4.154078 1.32736 0.005444
N  -2.989554 1.89353 0.000691
C  0.779674 -0.292817 -0.00003
C  -0.468559 -1.068086 -0.000004
C  -1.759728 -0.403246 0.000238
C  0.701409 1.148385 -0.000175
C  -1.755123 1.059273 0.000158
C  -0.573848 1.789213 -0.000106
C  2.06678 -0.888791 0.000048
C  -0.436663 -2.494902 -0.000304
C  1.899307 1.926933 -0.000284
C  -2.943115 -1.210363 -0.000089
C  3.235121 -0.102061 -0.00006
C  3.158886 1.325364 -0.000242
C  -1.607745 -3.26075 -0.000518
C  -2.86772 -2.609134 -0.000513
C  5.696327 -0.072058 -0.000083
H  -0.637822 2.881314 -0.000266
H  2.204448 -1.972161 0.000205
H  0.525561 -3.013718 -0.000451
H  1.816715 3.019444 -0.000391
H  -3.913458 -0.716978 0.000228
H  4.061792 1.941502 -0.00033
H  -1.549343 -4.354191 -0.000743
H  -3.791524 -3.197473 -0.000742
H  5.789146 0.556743 0.905688
H  5.78913 0.556516 -0.906013
H  6.481699 -0.841232 0.000007
