program: Gaussian 09
title: 000263249
version: EM64L-G09RevD.01
frameworkgroup: C1[X(C14H11NO)]
method: RPBEPBE
basis: SDD
operation: Freq
keyword: #p
keyword: freq=noraman
keyword: PBEPBE/SDD
title: #p freq=noraman PBEPBE/SDD
converged: YES YES NO NO
title: Mulliken charges:
elementType: O N C C C C C C C C C C C C C C H H H H H H H H H H H
charge: -0.251971 -0.424233 -0.362328 0.333596 0.091193 0.540016 0.078162 -0.407654 -0.364935 -0.453270 -0.374024 -0.213489 -0.226840 -0.222189 -0.220739 -0.242098 0.253742 0.319344 0.246719 0.267385 0.230560 0.250265 0.229724 0.232327 0.228885 0.229751 0.232098
chargesum: 0.00000
title: Mulliken charges with hydrogens summed into heavy atoms:
elementType: O N C C C C C C C C C C C C C C
charge: -0.251971 -0.104888 -0.108586 0.333596 0.091193 0.540016 0.078162 -0.160935 -0.097551 -0.222710 -0.123759 0.016235 0.005487 0.006697 0.009013 -0.010000
polarizability: 1.99515660e+02 8.77798766e+00 1.41401226e+02 1.64552142e+01 7.29628954e+00 1.13969876e+02
1716.lowfreq: -11.1494 -5.4465 -2.1994 -0.0009 -0.0008 -0.0007 22.1445 55.8923 60.8822
frequency: 22.0355 55.8833 60.8739 139.7296 189.3691 226.5297 232.7705 278.9403 313.2893 402.3084 414.3716 463.9739 468.9913 531.4258 559.1861 566.3888 601.0133 613.6647 621.6717 676.6927 704.7755 713.2707 739.2153 763.4293 773.6249 790.8915 827.9013 854.0491 873.3734 896.8054 926.7016 965.2622 977.7369 990.8018 998.2743 999.3677 1012.7728 1024.1258 1049.7608 1074.4596 1086.5758 1118.8416 1164.9795 1173.4573 1184.6215 1188.3858 1196.4555 1212.7071 1263.2559 1285.9344 1291.1007 1339.4089 1367.0454 1387.0847 1402.9006 1443.6141 1453.6283 1457.4250 1482.0338 1595.7234 1604.3915 1611.4952 1624.4816 1659.9822 2953.0890 3113.6366 3126.6367 3129.1232 3137.2282 3140.7319 3148.8156 3153.2833 3165.5204 3167.4398 3587.8541
redmass: 3.9025 5.0798 5.4285 5.2635 4.5467 5.2508 5.3701 5.9036 5.7380 2.7977 3.0064 4.2210 3.6392 6.2769 1.2351 6.7666 3.4685 6.4453 5.6308 4.6838 1.7864 4.4622 2.5573 4.6823 2.0715 1.9754 3.4714 1.2487 3.6517 1.5240 1.4905 1.4101 1.3911 6.2621 1.3221 1.3299 2.3150 2.2739 2.5925 2.9007 1.6789 2.1610 1.2154 1.0580 1.5273 1.3260 1.8323 1.9918 1.8383 1.4588 2.1056 1.2951 1.8100 6.5431 7.4942 2.1386 2.5763 2.6184 2.2838 6.1126 7.4605 6.0855 7.4526 8.9160 1.0831 1.0881 1.0861 1.0860 1.0910 1.0901 1.0960 1.0950 1.1014 1.1002 1.0794
irintensity: 0.2599 0.1784 0.9501 0.4562 2.0218 2.3335 1.5739 5.9932 0.9786 0.3892 5.3659 3.6291 5.4925 9.0205 110.0528 7.5540 4.2843 0.7350 18.5068 40.4093 48.1646 17.4577 45.8352 4.9476 39.7003 26.3823 6.9610 0.1322 3.4603 1.3635 4.1418 1.9212 0.0694 0.9175 0.2083 0.0416 9.3967 8.8789 7.8806 0.6495 10.5041 53.4003 3.7169 0.2003 27.4981 7.3746 7.4994 1.8230 21.2392 3.8494 58.3294 3.4350 27.5274 0.6421 3.3633 12.5606 15.4457 9.4355 13.8564 0.8530 0.6826 8.0738 14.2437 438.4136 22.8269 8.9500 0.8188 0.5929 10.1891 8.5213 32.6408 14.1111 24.5260 24.3816 42.6876
temp: 298.150 k
press: 1.00000 atm
elementType: 8 7 6 6 6 6 6 6 6 6 6 6 6 6 6 6 1 1 1 1 1 1 1 1 1 1 1
symmnumber: 1
zpe: 555154.6 jmol-1
zpe.correction: 0.211447 hartree
zpe.thermalcorrener: 0.223638 hartree
zpe.thermalcorrenthalpy: 0.224582 hartree
zpe.thermalcorrgfe: 0.171446 hartree
zpe.sumelectzpe: -668.994757 hartree
zpe.sumelectthermal: -668.982567 hartree
zpe.sumelectthermalent: -668.981622 hartree
zpe.sumelectthermalfe: -669.034758 hartree
dipole: -3.1483 -3.5187 -1.0459
dipole: 4.8360
quadrupole: -87.7672 -98.0499 -87.1623
quadrupole: -11.3763 1.8058 -1.4689
quadrupole: 3.2259 -7.0567 3.8308 -11.3763 1.8058 -1.4689
hfenergy: -669.2062042 hartree
pointgroup: C01 [X(C14H11N1O1)]
dipole: -1.1881093 -1.4696826 -0.2200026 debye
polarizability: 198.3500527|12.8818822|143.7154826|15.9289139|3.6881531|112.8212261 unknown
InChI: InChI=1S/C14H11NO/c16-14-12-9-5-4-8-11(12)13(15-14)10-6-2-1-3-7-10/h1-9,13,15H
charge 0 multiplicity 1
27 atoms
O  2.258305 2.880684 -0.14852
N  0.352447 1.694988 -0.930878
C  -0.155727 0.311374 -1.059975
C  0.985361 -0.481092 -0.408807
C  2.015583 0.40175 -0.012701
C  -1.532598 0.096994 -0.425459
C  1.620564 1.809433 -0.344284
C  1.104608 -1.865118 -0.194159
C  3.194498 -0.064714 0.598096
C  -2.562582 -0.534019 -1.162708
C  -1.788376 0.512309 0.905964
C  2.287669 -2.345353 0.421349
C  3.323746 -1.456669 0.811911
C  -3.831601 -0.756106 -0.578779
C  -3.054645 0.295599 1.488723
C  -4.080379 -0.341407 0.748601
H  -0.228072 0.031292 -2.132914
H  -0.173288 2.507787 -1.251338
H  0.304976 -2.556338 -0.482454
H  3.976995 0.642194 0.8930
H  -2.374129 -0.849635 -2.19711
H  -0.995121 1.007396 1.478261
H  2.404675 -3.419913 0.601526
H  4.227339 -1.856432 1.284992
H  -4.622546 -1.244486 -1.15876
H  -3.244792 0.6209 2.51763
H  -5.06351 -0.508716 1.202393
