program: Gaussian 09
title: 000263244
version: EM64L-G09RevD.01
frameworkgroup: C1[X(C18H12O)]
method: RPBEPBE
basis: SDD
operation: Freq
keyword: #pfreq=noraman
keyword: PBEPBE/SDD
title: #p freq=noraman PBEPBE/SDD
converged: YES YES NO NO
title: Mulliken charges:
elementType: O C C C C C C C C C C C C C C C C C C H H H H H H H H H H H H
charge: -0.432889 0.149516 0.068402 0.213650 0.410688 0.428098 0.397873 -0.462874 -0.472373 -0.486988 -0.483065 0.174905 -0.316348 -0.480127 -0.448606 -0.436676 -0.225161 -0.272238 -0.252013 0.239960 0.237526 0.239551 0.236699 0.241418 0.242283 0.237595 0.215007 0.229113 0.224714 0.226419 0.355940
chargesum: 0.00000
title: Mulliken charges with hydrogens summed into heavy atoms:
elementType: O C C C C C C C C C C C C C C C C C C
charge: -0.076949 0.149516 0.068402 0.213650 0.410688 0.428098 0.397873 -0.222914 -0.234847 -0.247437 -0.246366 0.174905 -0.074929 -0.237844 -0.211011 -0.221669 0.003952 -0.047525 -0.025594
polarizability: 3.14071808e+02 2.52927216e+00 2.38559702e+02 -1.27186432e+01 5.72322383e+00 8.83390259e+01
1716.lowfreq: -7.5544 -5.8909 -0.0002 0.0002 0.0004 1.6505 68.6876 85.1586 105.7312
frequency: 68.6831 85.1558 105.7301 166.8578 195.0546 203.9758 262.5309 287.0468 290.7860 343.0113 358.2607 402.8620 431.1595 433.1355 468.1841 500.4301 507.5184 515.6791 521.9039 544.5778 552.1949 582.5660 619.9312 646.4794 677.5755 685.2736 738.1373 742.2381 753.5520 769.4039 770.5549 805.4169 816.7156 827.9699 843.6986 871.5100 880.6096 920.4921 952.0310 956.0984 958.6203 970.5193 981.8891 986.9728 1027.7525 1050.8123 1079.0710 1118.3349 1150.8253 1162.0524 1169.2742 1175.1460 1183.4903 1215.7213 1229.7748 1233.5706 1255.7129 1263.1152 1294.3574 1355.8467 1393.5957 1401.0589 1403.5860 1413.1651 1422.8358 1430.8239 1452.8767 1495.5512 1506.9392 1531.8627 1566.0524 1605.4340 1609.2922 1615.0141 1633.0857 3109.4168 3119.1441 3120.5359 3122.8039 3132.9450 3134.2023 3144.9987 3148.5118 3155.8141 3162.4083 3189.8823 3568.3180
redmass: 5.3846 4.6348 5.0365 4.4394 5.6231 4.0099 5.4899 4.2205 3.7822 2.0868 1.8894 4.3774 4.3940 3.8543 3.9329 4.7082 4.8367 4.0236 5.1330 4.3057 5.7858 3.2150 3.8572 6.3261 3.3059 5.4679 5.2055 1.8371 1.3146 4.2832 1.8547 2.4663 2.0593 5.0248 1.5646 1.5487 1.6015 5.7641 1.3847 1.5670 2.8177 1.4430 1.4051 1.3399 3.0968 2.3272 2.4892 1.8726 1.3659 1.2566 1.1353 1.1041 1.3950 2.1233 2.2191 1.7750 1.7185 2.4674 1.8413 4.7700 4.6846 3.5176 4.2124 2.1251 2.7160 2.8099 2.5512 3.4752 3.7182 4.7599 7.4184 6.5926 6.6552 6.0168 6.9114 1.0891 1.0862 1.0859 1.0861 1.0905 1.0887 1.0988 1.0985 1.0981 1.0993 1.0943 1.0659
irintensity: 0.8906 0.1781 0.8627 7.4225 1.3665 0.8263 0.0396 0.4108 19.0669 40.2803 44.2760 4.7056 2.1543 1.6514 3.5603 3.8991 11.8007 1.6562 1.4212 1.0155 0.6567 6.1368 8.1798 4.1684 24.9163 0.6924 4.8832 20.7348 20.5892 10.4737 50.3884 4.2661 9.6422 4.1504 48.5953 23.5570 52.7138 20.5888 0.2252 4.8595 6.4568 0.8854 0.7419 0.7028 22.3160 47.6416 5.9796 11.6790 11.6161 12.1571 8.0024 1.4448 45.7028 12.0548 0.8177 9.0195 22.3766 34.6087 0.6479 5.3796 4.4846 3.4018 2.9040 10.4593 8.8776 4.8979 1.2849 12.1841 1.4499 12.6259 18.0463 4.8137 1.8460 6.5475 2.2631 13.7064 1.2164 2.4175 3.0333 15.2566 5.2365 25.5231 43.7699 46.5908 31.7605 12.3071 28.5231
temp: 298.150 k
press: 1.00000 atm
elementType: 8 6 6 6 6 6 6 6 6 6 6 6 6 6 6 6 6 6 6 1 1 1 1 1 1 1 1 1 1 1 1
symmnumber: 1
zpe: 631377.1 jmol-1
zpe.correction: 0.240479 hartree
zpe.thermalcorrener: 0.253996 hartree
zpe.thermalcorrenthalpy: 0.254940 hartree
zpe.thermalcorrgfe: 0.201069 hartree
zpe.sumelectzpe: -767.091961 hartree
zpe.sumelectthermal: -767.078444 hartree
zpe.sumelectthermalent: -767.077500 hartree
zpe.sumelectthermalfe: -767.131370 hartree
dipole: 1.1942 -1.0979 0.2798
dipole: 1.6461
quadrupole: -94.2029 -88.7103 -115.4230
quadrupole: -3.7341 -0.5624 -1.6463
quadrupole: 5.2425 10.7351 -15.9776 -3.7341 -0.5624 -1.6463
hfenergy: -767.3324395 hartree
pointgroup: C01 [X(C18H12O1)]
dipole: -0.4645987 0.4373946 0.1107818 debye
polarizability: 314.1066857|1.5804345|238.5352758|12.7903063|-5.5337097|88.3285742 unknown
InChI: InChI=1S/C18H12O/c19-16-7-3-5-13-10-11-14-9-8-12-4-1-2-6-15(12)17(14)18(13)16/h1-11,19H
charge 0 multiplicity 1
31 atoms
O  -0.52094 2.227996 1.115637
C  0.046936 -0.485235 0.049937
C  -1.269514 0.159354 0.044227
C  1.330824 0.205783 -0.082803
C  0.079107 -1.919928 0.125118
C  -2.440228 -0.636046 -0.280834
C  2.556642 -0.512541 0.200668
C  -1.11905 -2.690874 -0.094441
C  1.317686 -2.612291 0.381236
C  -2.318569 -2.069411 -0.381429
C  2.511379 -1.923354 0.488507
C  -1.543398 1.511467 0.466504
C  1.458562 1.532657 -0.60732
C  -3.73107 -0.035084 -0.414532
C  3.817312 0.158464 0.107322
C  -2.819277 2.089157 0.332444
C  -3.913745 1.323872 -0.147486
C  2.705061 2.155605 -0.734265
C  3.897011 1.48081 -0.337827
H  -1.044814 -3.784356 -0.073268
H  1.28686 -3.702319 0.494134
H  -3.213952 -2.653206 -0.622867
H  3.446321 -2.446786 0.719655
H  0.566605 2.059667 -0.949074
H  -4.578966 -0.668068 -0.69811
H  4.727518 -0.400036 0.356887
H  -2.97442 3.132263 0.639432
H  -4.898177 1.790536 -0.254736
H  2.76595 3.16626 -1.153134
H  4.867072 1.983404 -0.419099
H  -0.872426 3.086741 1.460923
