program: Gaussian 09
title: 000263208
version: EM64L-G09RevD.01
frameworkgroup: C1[X(C19H16O2)]
method: RPBEPBE
basis: SDD
operation: Freq
keyword: #pfreq=noraman
keyword: PBEPBE/SDD
title: #p freq=noraman PBEPBE/SDD
converged: YES YES NO NO
title: Mulliken charges:
elementType: O O C C C C C C C C C C C C C C C C C C C H H H H H H H H H H H H H H H H
charge: -0.457191 -0.432177 -0.097552 0.349795 0.367016 0.316627 -0.376938 -0.367603 -0.376784 -0.358455 -0.384488 -0.381366 -0.407708 -0.346690 -0.245818 -0.246256 -0.255782 -0.230449 0.279813 -0.241184 -0.240911 0.265946 0.278994 0.260327 0.250291 0.259777 0.286209 0.347417 0.220253 0.250391 0.227644 0.223671 0.229016 0.224939 0.230409 0.225549 0.353268
chargesum: 0.00000
title: Mulliken charges with hydrogens summed into heavy atoms:
elementType: O O C C C C C C C C C C C C C C C C C C C
charge: -0.109774 -0.078909 -0.097552 0.349795 0.367016 0.316627 -0.110993 -0.088609 -0.116457 -0.108163 -0.124711 -0.095157 -0.187455 -0.096299 -0.018174 -0.022585 -0.026766 -0.005510 0.279813 -0.010774 -0.015362
polarizability: 2.35952406e+02 -1.00357318e+01 2.15472083e+02 8.19598826e-01 7.83055142e+00 1.60853162e+02
1716.lowfreq: -8.3671 -2.3175 -0.0007 -0.0007 0.0002 2.2725 25.3459 40.4394 48.1148
frequency: 24.9511 40.3856 48.0822 58.9882 70.4553 82.4806 163.4230 184.8673 218.2060 252.1733 258.4680 270.7111 295.2213 326.0877 328.0221 355.6534 362.6648 401.1745 402.2910 404.5733 414.4471 459.1582 494.1432 533.0294 568.3578 582.5600 615.6618 616.3739 625.9342 635.3317 674.5125 705.7169 707.0718 730.1907 762.3967 772.1019 801.6060 805.4792 839.6913 854.7037 860.8914 885.1228 897.6923 921.4107 942.2389 945.4922 954.8480 978.2430 980.4321 985.0480 990.0211 990.4839 997.0781 1000.4289 1006.4345 1028.2246 1029.4505 1084.8901 1086.1759 1104.4379 1141.2534 1148.5769 1162.1616 1171.0987 1173.4717 1180.5146 1191.0736 1194.9561 1212.0655 1248.0084 1293.3312 1306.8918 1318.0157 1326.7809 1376.7136 1380.1916 1386.7732 1420.8251 1433.1570 1435.2352 1478.9536 1481.0949 1498.4637 1587.2313 1591.0812 1594.4883 1608.5302 1611.5102 1622.6243 3110.6299 3113.0771 3121.7661 3127.7553 3132.3350 3139.9689 3144.4559 3146.1780 3152.3683 3154.8557 3159.5828 3166.6439 3173.3485 3179.2615 3549.9743 3580.7422
redmass: 3.8898 4.4195 4.7895 4.2245 4.8654 4.5550 5.8248 4.9331 4.7476 3.5277 5.7656 1.6759 3.0954 4.9669 3.8737 1.1357 5.3037 3.9422 2.8634 2.8582 3.0140 4.8081 3.7520 2.9104 4.3044 5.1115 6.3198 6.3848 5.3911 6.7372 6.2625 1.7915 1.7356 3.9811 1.9808 1.9725 5.7308 1.4190 1.5017 1.2510 1.2531 3.0600 3.1996 1.7054 1.7795 1.4752 3.4793 1.3503 1.3950 1.3771 5.8971 6.0008 1.3157 1.3303 2.7093 2.2997 2.1842 1.6020 1.5871 1.4398 1.5315 2.0176 2.2479 1.0653 1.0537 1.1371 1.1412 1.1218 3.6741 2.7395 1.7228 1.3316 1.3218 1.3998 7.1577 9.0017 5.8450 3.2086 2.2188 2.2503 2.1725 2.2495 2.6491 6.0554 6.3033 6.6548 6.0198 6.0644 6.3604 1.0887 1.0871 1.0845 1.0866 1.0887 1.0925 1.0944 1.0937 1.0880 1.0951 1.0990 1.0999 1.0968 1.0951 1.0659 1.0660
irintensity: 0.0631 0.3368 0.0937 0.4482 0.6629 0.1199 0.1162 1.1120 3.2586 13.9858 0.9375 63.6833 35.5280 4.9917 82.7853 122.4223 16.5984 9.8266 0.7138 0.7913 1.0334 8.0005 1.1808 7.8343 28.8956 23.4171 0.9888 0.1756 23.9279 5.3294 2.5627 47.1474 58.6680 6.9942 36.3389 59.5365 22.0203 38.7622 46.5941 0.2160 0.1049 14.2485 19.8246 17.1367 4.1269 0.4742 32.8598 0.2744 0.5134 0.2828 0.8263 0.9764 0.1142 0.2704 3.0413 6.2966 15.0291 1.7102 2.5573 55.5271 207.5503 65.4324 19.8844 0.9136 0.2080 19.5879 3.9481 3.6380 23.0886 33.0532 45.5482 12.7644 9.7467 11.7446 1.0960 1.6951 22.3604 4.7829 14.0523 22.5391 12.5246 23.2633 88.4133 1.4971 1.4621 17.7410 7.4628 2.4447 48.7982 23.0436 7.0364 0.2895 0.5952 11.2437 23.0488 5.4592 35.6327 1.8884 24.9042 26.3201 21.1377 6.1847 7.6348 7.6302 42.4448
temp: 298.150 k
press: 1.00000 atm
elementType: 8 8 6 6 6 6 6 6 6 6 6 6 6 6 6 6 6 6 6 6 6 1 1 1 1 1 1 1 1 1 1 1 1 1 1 1 1
symmnumber: 1
zpe: 766473.8 jmol-1
zpe.correction: 0.291934 hartree
zpe.thermalcorrener: 0.309643 hartree
zpe.thermalcorrenthalpy: 0.310587 hartree
zpe.thermalcorrgfe: 0.245325 hartree
zpe.sumelectzpe: -882.598841 hartree
zpe.sumelectthermal: -882.581132 hartree
zpe.sumelectthermalent: -882.580188 hartree
zpe.sumelectthermalfe: -882.645451 hartree
dipole: -0.1193 -2.2912 -2.0868
dipole: 3.1014
quadrupole: -117.9957 -112.4511 -115.5619
quadrupole: -6.2321 -5.2951 -0.0907
quadrupole: -2.6595 2.8851 -0.2257 -6.2321 -5.2951 -0.0907
hfenergy: -882.8907753 hartree
pointgroup: C01 [X(C19H16O2)]
dipole: -0.1933093 0.7913059 0.9084844 debye
polarizability: 234.0387773|8.0237064|212.8846216|10.9687439|15.7397589|165.3542521 unknown
InChI: InChI=1S/C19H16O2/c20-18-13-11-17(12-14-18)19(21,15-7-3-1-4-8-15)16-9-5-2-6-10-16/h1-14,20-21H
charge 0 multiplicity 1
37 atoms
O  -0.139488 0.240617 -2.203164
O  5.20794 0.047492 1.323935
C  -0.209591 0.093628 -0.715392
C  1.223788 0.152643 -0.142999
C  -1.11562 1.233381 -0.188063
C  -0.825409 -1.30204 -0.48586
C  1.510923 0.66339 1.145659
C  2.290098 -0.396629 -0.903424
C  -2.448356 1.011195 0.234265
C  -0.690315 -1.952374 0.766046
C  -0.631554 2.570478 -0.227295
C  -1.575944 -1.931738 -1.508572
C  2.825619 0.642225 1.661945
C  3.605375 -0.422234 -0.404753
C  -3.276403 2.093966 0.609357
C  -1.294179 -3.208884 0.99181
C  -1.458104 3.653205 0.139616
C  -2.173233 -3.193437 -1.285826
C  3.873587 0.099486 0.882264
C  -2.787992 3.418601 0.561517
C  -2.038113 -3.836514 -0.034392
H  0.707999 1.091906 1.755209
H  2.071115 -0.803507 -1.895481
H  -2.841742 -0.009245 0.270712
H  -0.101888 -1.485483 1.563006
H  0.405833 2.764925 -0.528255
H  -1.67101 -1.428172 -2.473811
H  0.118166 1.1780 -2.399685
H  3.028401 1.047048 2.662393
H  4.430316 -0.841337 -0.988512
H  -4.304461 1.900842 0.93601
H  -1.177765 -3.700017 1.96465
H  -1.065317 4.675581 0.101832
H  -2.744348 -3.672043 -2.089661
H  -3.43217 4.256703 0.850068
H  -2.500919 -4.814826 0.13851
H  5.292068 0.424566 2.234747
