program: Gaussian 09
title: 000263198
version: EM64L-G09RevD.01
frameworkgroup: C1[X(C13H20N2O4)]
method: RPBEPBE
basis: SDD
operation: Freq
keyword: #p
keyword: freq=noraman
keyword: PBEPBE/SDD
title: #p freq=noraman PBEPBE/SDD
converged: YES YES NO NO
title: Mulliken charges:
elementType: O O O O N N C C C C C C C C C C C C C H H H H H H H H H H H H H H H H H H H H
charge: -0.280292 -0.277321 -0.217966 -0.213527 -0.124548 -0.106111 -0.083527 -0.427661 -0.395103 -0.384590 -0.702777 0.210274 0.210047 -0.622480 -0.611543 0.251298 0.254671 -0.763258 -0.761741 0.280754 0.252028 0.270461 0.272065 0.233711 0.272009 0.231720 0.228167 0.224621 0.228514 0.258461 0.255624 0.251443 0.254830 0.271638 0.251564 0.243679 0.243133 0.252110 0.269621
chargesum: 0.00000
title: Mulliken charges with hydrogens summed into heavy atoms:
elementType: O O O O N N C C C C C C C C C C C C C
charge: -0.280292 -0.277321 -0.217966 -0.213527 -0.124548 -0.106111 0.197228 0.094828 0.110674 0.119139 -0.021474 0.210274 0.210047 -0.108395 -0.105269 0.251298 0.254671 0.003623 0.003123
polarizability: 2.12613629e+02 -1.86228801e+00 1.59000485e+02 6.28358622e+00 5.85006827e+00 1.29873896e+02
1716.lowfreq: -12.8187 -7.4908 0.0000 0.0002 0.0003 10.1800 23.9885 37.1605 46.3240
frequency: 23.9065 36.9572 46.3213 51.3106 56.6265 64.4696 75.4279 79.5488 111.7863 136.7201 142.6773 147.0807 162.1140 199.6588 212.9790 246.6085 264.9132 302.9729 331.9737 356.6870 379.8694 403.7022 429.7822 449.7963 463.5873 469.7592 470.6449 515.1685 526.4579 541.4431 560.4835 580.4302 618.0442 654.6074 704.0406 715.0546 743.7786 807.8083 808.3142 863.2631 879.6931 899.5893 906.1596 911.5735 925.5933 953.1209 1006.9439 1018.2155 1019.6766 1025.6566 1028.7237 1052.8842 1077.8661 1095.1905 1110.2419 1130.1313 1145.9608 1162.6383 1192.6701 1209.0904 1213.0748 1239.7800 1245.3671 1249.9041 1270.5797 1273.4609 1312.7237 1334.6452 1338.6190 1356.1971 1369.2027 1374.2179 1375.2337 1388.9794 1408.8132 1419.5519 1443.3328 1444.6093 1449.4085 1452.0700 1452.7789 1463.9534 1465.3381 1470.5202 1474.3067 1484.5882 1488.3689 1580.1092 1582.9269 1626.2480 1629.8945 2978.9917 2980.5460 2985.5496 2986.9468 2992.1122 3001.0324 3041.7166 3043.3820 3059.3857 3061.0821 3063.6430 3084.3148 3088.8563 3090.8614 3097.0043 3106.5250 3115.0607 3115.9791 3125.1686 3125.3066
redmass: 4.4441 7.9188 4.1308 5.1362 5.1407 5.2178 4.2250 5.2736 3.9743 2.1368 1.6944 2.7176 1.0837 4.1146 1.0491 2.8522 4.5069 5.3116 2.4347 3.1758 2.8481 2.4689 2.6517 2.6931 3.0054 3.8035 3.9445 2.8117 3.0029 2.8622 4.1111 3.7004 4.1500 5.0346 3.2122 3.7312 2.3695 3.6422 3.6121 2.6210 1.8132 2.8148 1.7437 1.7177 2.1118 2.4553 1.8630 1.8150 2.0313 1.8581 1.9424 2.1479 1.9041 1.7684 2.0930 1.3467 1.6260 3.3010 2.3147 2.6732 4.3562 1.5198 1.4028 1.3916 1.4757 1.5338 1.4814 1.5590 1.2960 1.4153 1.3734 1.2624 1.2470 1.2308 2.0472 2.3083 1.0739 1.0705 1.0649 1.0662 1.0965 1.0926 1.0698 1.0910 1.0606 1.0687 1.0860 8.1544 7.9970 7.3716 7.5234 1.0376 1.0380 1.0444 1.0600 1.0686 1.0642 1.0580 1.0588 1.0873 1.0949 1.0946 1.0994 1.0975 1.0972 1.0978 1.0962 1.1036 1.1055 1.1009 1.1011
irintensity: 0.0977 0.4400 1.0340 9.8320 2.9362 5.5660 6.7234 3.7464 6.8717 4.5126 3.0542 0.5302 0.6826 1.6405 1.0008 5.2647 11.5934 0.5875 0.1359 9.4925 4.1514 3.0844 6.3311 3.9607 5.8154 2.6254 10.0018 1.5105 11.0115 12.7390 29.8584 8.2998 7.5135 1.5314 3.9116 1.3715 0.7556 0.6978 0.3251 3.3805 6.3484 15.6111 21.9695 6.8354 3.4444 2.8305 11.0584 38.5607 3.5733 18.7620 2.5994 97.1369 0.7439 15.8228 7.9498 12.9301 15.2708 26.0614 207.9858 259.8426 132.7388 5.7220 81.0245 35.6609 18.4605 40.5949 6.2930 35.4851 20.1256 13.4975 16.3121 94.0381 73.5155 21.8723 29.2693 119.5884 34.5766 34.0010 20.0535 19.0910 13.2950 26.5402 28.8637 19.7546 23.8236 4.3386 14.3996 425.6963 328.8020 59.1797 99.0489 2.3954 2.4794 24.6669 6.0435 12.4769 59.9361 5.1491 6.3354 6.3682 3.4310 4.5969 25.4854 26.9348 1.5644 6.6776 2.4180 11.6724 9.8204 7.1377 9.1329
temp: 298.150 k
press: 1.00000 atm
elementType: 8 8 8 8 7 7 6 6 6 6 6 6 6 6 6 6 6 6 6 1 1 1 1 1 1 1 1 1 1 1 1 1 1 1 1 1 1 1 1
symmnumber: 1
zpe: 839363.8 jmol-1
zpe.correction: 0.319697 hartree
zpe.thermalcorrener: 0.340291 hartree
zpe.thermalcorrenthalpy: 0.341235 hartree
zpe.thermalcorrgfe: 0.268354 hartree
zpe.sumelectzpe: -916.327913 hartree
zpe.sumelectthermal: -916.307319 hartree
zpe.sumelectthermalent: -916.306374 hartree
zpe.sumelectthermalfe: -916.379256 hartree
dipole: -0.4703 0.0324 1.9111
dipole: 1.9684
quadrupole: -106.5815 -136.7967 -106.7735
quadrupole: -3.4857 0.1364 -4.6120
quadrupole: 10.1358 -20.0795 9.9437 -3.4857 0.1364 -4.6120
hfenergy: -916.6476099 hartree
pointgroup: C01 [X(C13H20N2O4)]
dipole: -0.166812 -0.7395516 -0.1579957 debye
polarizability: 212.914716|-3.8762713|133.6365062|-1.6793303|-11.7217018|154.9367883 unknown
InChI: InChI=1S/C13H20N2O4/c1-9-8-14(12(18)6-10(2)16)4-5-15(9)13(19)7-11(3)17/h9H,4-8H2,1-3H3
charge 0 multiplicity 1
39 atoms
O  -3.468855 0.636683 -1.848675
O  3.22217 0.81187 -1.851387
O  -2.828955 -0.825839 2.140016
O  3.225958 -0.7927 2.220705
N  -1.472394 -0.367507 -1.178523
N  1.284021 0.206517 -0.711116
C  -0.674724 -1.308542 -0.336257
C  0.505554 -0.525692 0.308469
C  -0.704675 0.436421 -2.163614
C  0.465783 1.170615 -1.482024
C  -0.193379 -2.532761 -1.147484
C  -2.85185 -0.215251 -1.132923
C  2.636831 0.078628 -0.992196
C  -3.647115 -1.099005 -0.142758
C  3.439891 -0.97889 -0.201988
C  -3.644256 -0.449522 1.25372
C  3.842278 -0.433544 1.181489
C  -4.640987 0.672823 1.467771
C  4.991469 0.55729 1.200479
H  -1.304958 -1.640908 0.504643
H  0.091331 0.207865 1.028413
H  1.147669 -1.208571 0.88382
H  -1.407213 1.153667 -2.618008
H  -0.314313 -0.223896 -2.961745
H  1.116802 1.650556 -2.230034
H  0.074468 1.945415 -0.793545
H  0.539611 -2.245323 -1.922175
H  0.287655 -3.26676 -0.475675
H  -1.04277 -3.031954 -1.646514
H  -3.246465 -2.122487 -0.072396
H  -4.672694 -1.130125 -0.543616
H  4.341162 -1.16674 -0.80767
H  2.880957 -1.918627 -0.069849
H  -4.651313 1.346473 0.590719
H  -4.409577 1.231377 2.387503
H  -5.660986 0.249234 1.552924
H  5.946154 0.013125 1.059169
H  5.028788 1.090445 2.162746
H  4.905828 1.269644 0.359685
