program: Gaussian 09
title: 000263193
version: EM64L-G09RevD.01
frameworkgroup: C1[X(C12H18O5)]
method: RPBEPBE
basis: SDD
operation: Freq
keyword: #pfreq=noraman
keyword: PBEPBE/SDD
title: #p freq=noraman PBEPBE/SDD
converged: YES YES NO NO
title: Mulliken charges:
elementType: O O O O O C C C C C C C C C C C C H H H H H H H H H H H H H H H H H H
charge: -0.302780 -0.282981 -0.274350 -0.234244 -0.233464 -0.094432 -0.086924 -0.482242 -0.493808 -0.210565 -0.203514 0.222645 0.223736 -0.214988 -0.263923 -0.681629 -0.660673 0.228483 0.224865 0.254244 0.216230 0.233886 0.248516 0.303810 0.280999 0.234824 0.226336 0.223146 0.236020 0.233129 0.213694 0.227317 0.225166 0.217536 0.245939
chargesum: 0.00000
title: Mulliken charges with hydrogens summed into heavy atoms:
elementType: O O O O O C C C C C C C C C C C C
charge: -0.302780 -0.282981 -0.274350 -0.234244 -0.233464 0.134051 0.137940 -0.011768 -0.011406 0.093244 0.077484 0.222645 0.223736 0.246172 0.195242 -0.007488 0.027967
polarizability: 1.61268105e+02 -2.49303041e+00 1.42818104e+02 -1.93572138e+00 6.10908722e+00 1.15182343e+02
1716.lowfreq: -9.8021 -0.0002 0.0002 0.0006 7.0366 13.8356 26.9234 39.3239 50.0013
frequency: 26.5735 39.1952 49.9310 61.2889 71.6226 76.4724 87.1124 91.7579 128.5119 143.5976 185.9212 203.4513 231.1505 253.7285 272.0788 300.3491 312.0853 331.0191 335.6419 365.5375 375.6776 441.3150 515.0377 531.7664 598.2031 630.7362 653.0012 705.1410 714.0575 743.6900 772.2492 788.2236 798.8263 809.2497 819.2713 830.8650 864.2221 933.8998 950.1151 952.7195 981.6147 1012.7112 1015.1780 1027.0761 1038.8710 1062.0750 1095.8177 1110.5201 1111.6039 1120.7822 1135.6317 1148.4992 1157.0298 1175.4092 1192.3120 1214.6726 1241.8475 1247.5201 1272.0070 1279.4383 1288.9788 1298.4040 1322.0702 1335.2585 1342.6245 1354.5870 1355.8124 1367.1191 1389.8095 1398.3124 1411.7292 1452.8795 1457.3160 1459.5108 1462.4894 1463.5629 1474.1897 1484.1540 1486.4936 1635.9149 1640.9060 2982.3157 2991.6145 2993.8959 2998.3038 3011.5281 3023.1459 3029.5594 3042.4297 3056.7680 3065.8563 3069.3970 3085.4278 3087.2922 3090.5493 3090.8225 3104.8119 3105.3309 3117.3654
redmass: 4.8288 3.8147 3.2626 3.7690 3.1950 3.5178 3.3871 3.7385 3.7229 3.5704 3.0569 1.9912 1.7870 1.5017 3.1167 3.8908 3.4377 2.3974 5.3954 3.7136 3.5874 3.5264 3.2359 4.1218 6.0398 5.4050 5.7367 6.0267 5.2953 3.6632 3.2883 4.0100 1.1023 1.6236 2.5009 2.3635 2.5188 3.0730 2.5018 3.2214 2.1239 2.0895 2.7030 2.5860 1.4999 2.1650 2.1745 1.8421 1.9610 3.1137 1.4704 2.2453 1.6696 1.3839 3.3722 1.3998 1.2298 1.1372 1.2942 1.1184 1.3415 1.3028 1.5825 1.3149 1.7539 1.3027 1.3861 1.5609 1.2343 1.2677 2.8245 1.0829 1.0924 1.1205 1.0412 1.0448 1.0611 1.0511 1.0689 9.7708 10.8341 1.0620 1.0357 1.0357 1.0623 1.0583 1.0825 1.0593 1.0884 1.0950 1.0983 1.1061 1.0876 1.0977 1.0987 1.1029 1.1027 1.0942 1.1066
irintensity: 0.0757 0.9602 0.7500 0.2102 1.3598 0.7224 2.5299 1.7428 3.8932 0.7769 3.3440 1.5673 5.3764 0.1193 3.7083 11.5104 2.1021 2.1154 10.0644 4.2041 19.8208 13.7714 3.3562 1.5838 7.5713 1.7073 3.5408 13.4877 6.8518 2.5822 24.2947 6.5761 3.1723 1.4124 2.1016 4.0258 2.3931 73.0841 0.9089 29.6650 9.7289 5.7640 46.7983 83.4978 29.8080 24.6706 39.7544 3.6538 8.6082 207.9359 4.3241 41.8875 8.6265 35.8981 267.1110 12.7666 6.1835 0.4331 11.8228 3.1714 53.4153 27.9666 1.0401 3.1405 0.8741 2.3430 0.2823 10.9803 16.3108 22.5047 10.3582 18.2046 12.0928 6.5454 9.5310 10.7945 5.1235 19.6446 10.9276 36.5710 307.7399 19.1879 18.9445 18.7996 14.5408 19.6578 2.8577 32.0235 4.2502 6.6825 12.6353 4.1866 23.3490 44.6631 30.2758 1.9538 39.6546 70.4909 33.4824
temp: 298.150 k
press: 1.00000 atm
elementType: 8 8 8 8 8 6 6 6 6 6 6 6 6 6 6 6 6 1 1 1 1 1 1 1 1 1 1 1 1 1 1 1 1 1 1
symmnumber: 1
zpe: 750444.0 jmol-1
zpe.correction: 0.285829 hartree
zpe.thermalcorrener: 0.304040 hartree
zpe.thermalcorrenthalpy: 0.304984 hartree
zpe.thermalcorrgfe: 0.237739 hartree
zpe.sumelectzpe: -842.836831 hartree
zpe.sumelectthermal: -842.818619 hartree
zpe.sumelectthermalent: -842.817675 hartree
zpe.sumelectthermalfe: -842.884920 hartree
dipole: 2.6879 -1.5063 -4.8805
dipole: 5.7718
quadrupole: -95.4440 -94.1318 -107.6371
quadrupole: -0.9376 7.1019 -5.9126
quadrupole: 3.6270 4.9392 -8.5661 -0.9376 7.1019 -5.9126
hfenergy: -843.1226597 hartree
pointgroup: C01 [X(C12H18O5)]
dipole: 1.0193702 0.5487527 1.953519 debye
polarizability: 161.1637064|2.3688185|142.5188582|2.8378887|6.8240578|115.5859884 unknown
InChI: InChI=1S/C12H18O5/c1-3-15-11(13)7-5-9-10(17-9)6-8(7)12(14)16-4-2/h7-10H,3-6H2,1-2H3
charge 0 multiplicity 1
35 atoms
O  -3.825468 0.532916 -0.437961
O  1.022312 -1.666617 0.30625
O  1.307983 2.088193 0.497005
O  -0.059163 -2.638144 -1.513905
O  1.095071 0.929901 -1.518299
C  -3.323147 -0.311038 0.712534
C  -3.041351 1.163611 0.705146
C  -2.232335 -1.311185 0.376253
C  -1.667141 1.704468 0.333776
C  -1.062743 -0.667478 -0.426966
C  -0.560777 0.601946 0.300359
C  -0.00183 -1.740795 -0.644643
C  0.685516 1.178584 -0.361253
C  2.109716 -2.684957 0.179335
C  2.547853 2.753564 -0.013289
C  3.109263 -2.404875 1.296771
C  3.779014 1.898404 0.297887
H  -4.130647 -0.686728 1.356365
H  -3.667373 1.81332 1.330628
H  -2.6619 -2.146154 -0.207462
H  -1.843251 -1.733188 1.325524
H  -1.364938 2.485154 1.054076
H  -1.747524 2.187792 -0.659139
H  -1.439492 -0.395859 -1.42964
H  -0.290734 0.343385 1.340829
H  2.555673 -2.584557 -0.826474
H  1.655816 -3.689649 0.255654
H  2.56597 3.717296 0.520455
H  2.437064 2.918411 -1.099336
H  3.528535 -1.388096 1.203841
H  3.941334 -3.130697 1.245644
H  2.631025 -2.494703 2.287294
H  3.848495 1.687507 1.379097
H  4.69492 2.435941 -0.010553
H  3.738458 0.943629 -0.253203
