program: Gaussian 09
title: 000263191
version: EM64L-G09RevD.01
frameworkgroup: C1[X(C12H15NO2)]
method: RPBEPBE
basis: SDD
operation: Freq
keyword: #p
keyword: freq=noraman
keyword: PBEPBE/SDD
title: #p freq=noraman PBEPBE/SDD
converged: YES YES NO NO
title: Mulliken charges:
elementType: O O N C C C C C C C C C C C C H H H H H H H H H H H H H H H
charge: -0.286833 -0.217140 -0.093089 -0.587931 0.514174 0.228438 -0.612658 -0.652242 -0.367108 -0.429682 0.246408 -0.230942 -0.223281 -0.239204 -0.761995 0.275035 0.226550 0.262658 0.250815 0.232443 0.287614 0.242423 0.257233 0.230316 0.227494 0.226918 0.230036 0.249832 0.272848 0.240873
chargesum: 0.00000
title: Mulliken charges with hydrogens summed into heavy atoms:
elementType: O O N C C C C C C C C C C C C
charge: -0.286833 -0.217140 -0.093089 -0.086346 0.514174 0.228438 -0.099185 0.110237 -0.109875 -0.199366 0.246408 -0.003448 0.003637 -0.009168 0.001557
polarizability: 1.84483318e+02 1.13836343e+01 1.33141259e+02 -1.09844119e+01 9.50325641e+00 9.99366219e+01
1716.lowfreq: -11.7031 -6.0912 0.0004 0.0006 0.0007 4.5567 19.2933 28.1066 34.2809
frequency: 18.6500 27.8008 34.2011 42.7277 74.5510 77.3571 114.0277 157.3930 167.2074 211.5338 236.8891 291.4009 318.5335 392.1403 404.2749 423.7399 449.2610 465.9373 506.2187 521.8785 574.9381 607.8301 617.6093 664.0500 706.1329 735.8148 774.7160 807.2834 813.9469 858.2763 906.7294 912.3535 940.6606 976.8784 980.7130 989.8934 998.6163 1018.2440 1025.8941 1028.0381 1081.7620 1096.1841 1113.1882 1145.6327 1172.7992 1185.1462 1187.3065 1210.0606 1226.0288 1248.8644 1262.3806 1324.8894 1354.1632 1372.2646 1380.1798 1391.8350 1441.4969 1443.4919 1449.3067 1452.8306 1456.3512 1462.8752 1483.2365 1488.9205 1500.5141 1583.4659 1595.1271 1613.8428 1628.5152 2973.0464 2979.5897 2998.1896 3043.7629 3061.8245 3063.2216 3069.9982 3106.0055 3113.7679 3118.7485 3123.6805 3124.7644 3135.1439 3146.5045 3163.6684
redmass: 3.9454 3.0712 3.5442 4.3764 4.1137 2.4313 2.1236 3.4339 1.1177 3.7376 5.1180 3.0032 5.9321 2.1325 2.8200 2.1725 2.8204 4.8262 3.4563 2.9297 4.4281 4.2472 6.1533 5.0161 1.9468 2.1389 2.9495 3.5461 3.5199 1.2454 1.7048 1.7273 1.9782 2.1256 1.3918 5.8551 1.3290 1.7937 2.0371 1.9213 1.5764 1.5650 1.3328 1.5438 1.0559 2.3198 1.1830 2.7268 2.7231 1.3634 1.7038 1.3254 1.3595 1.2578 4.3294 3.0797 1.6272 1.2488 1.1572 1.1310 1.0911 1.1286 2.0418 1.1496 1.0618 6.8654 6.0469 6.0533 7.3283 1.0383 1.0376 1.0622 1.0578 1.0971 1.0949 1.0999 1.1021 1.0877 1.1049 1.0863 1.1013 1.0913 1.0961 1.1015
irintensity: 0.0617 2.4019 1.7299 2.3796 13.0702 0.1469 4.2897 1.1288 0.6084 6.8079 3.0071 4.3441 4.7984 6.1962 0.2273 0.7840 0.4816 5.7193 21.6220 7.0726 16.7275 13.7558 0.3204 1.0259 44.9210 45.8489 8.8906 0.4546 10.7115 0.0522 17.3179 0.4937 4.9333 3.4430 0.0692 0.4857 0.7573 12.4516 10.8102 0.8084 20.9097 102.9403 2.7186 43.7834 0.6293 99.1573 5.1511 23.8698 156.9360 57.5354 15.2986 12.5077 9.2073 97.5116 21.2420 24.6823 33.8264 14.4607 16.5108 5.9523 17.6570 33.5003 4.0758 47.0759 10.0898 299.2032 3.4087 6.4273 93.2716 45.7841 3.4829 36.9898 5.5447 19.9367 4.2052 10.5234 1.8830 9.8308 7.4363 0.5374 8.6371 11.1048 35.2063 24.2796
temp: 298.150 k
press: 1.00000 atm
elementType: 8 8 7 6 6 6 6 6 6 6 6 6 6 6 6 1 1 1 1 1 1 1 1 1 1 1 1 1 1 1
symmnumber: 1
zpe: 642687.2 jmol-1
zpe.correction: 0.244787 hartree
zpe.thermalcorrener: 0.260207 hartree
zpe.thermalcorrenthalpy: 0.261152 hartree
zpe.thermalcorrgfe: 0.198882 hartree
zpe.sumelectzpe: -670.364384 hartree
zpe.sumelectthermal: -670.348963 hartree
zpe.sumelectthermalent: -670.348019 hartree
zpe.sumelectthermalfe: -670.410288 hartree
dipole: 1.5005 0.7142 -0.9432
dipole: 1.9108
quadrupole: -84.6637 -93.5392 -87.7396
quadrupole: 9.8116 -1.8941 7.7609
quadrupole: 3.9838 -4.8917 0.9079 9.8116 -1.8941 7.7609
hfenergy: -670.6091704 hartree
pointgroup: C01 [X(C12H15N1O2)]
dipole: -0.6214073 0.2599194 0.3338554 debye
polarizability: 186.5280357|-6.9509056|128.879662|-7.6884687|-13.7160851|102.1535008 unknown
InChI: InChI=1S/C12H15NO2/c1-10(14)8-12(15)13(2)9-11-6-4-3-5-7-11/h3-7H,8-9H2,1-2H3
charge 0 multiplicity 1
30 atoms
O  1.639372 -1.446894 -0.321324
O  3.862751 2.144428 0.638609
N  0.609015 0.637122 -0.106825
C  -0.457377 0.239399 -1.064723
C  -1.813514 0.041358 -0.394948
C  1.580579 -0.295209 0.220952
C  2.645831 0.121926 1.260871
C  0.47778 1.968905 0.519333
C  -2.001534 -1.017571 0.531825
C  -2.901643 0.899948 -0.684693
C  3.788021 0.887552 0.567196
C  -3.252447 -1.208002 1.157214
C  -4.157463 0.709554 -0.061889
C  -4.335223 -0.344283 0.862484
C  4.778803 0.042207 -0.211494
H  -0.11329 -0.69934 -1.532656
H  -0.52854 1.019321 -1.846742
H  2.225193 0.74567 2.064722
H  3.028707 -0.821882 1.681694
H  0.030791 2.660394 -0.216302
H  1.460745 2.37453 0.803088
H  -0.187051 1.939588 1.404265
H  -1.166438 -1.694164 0.750204
H  -2.769125 1.718696 -1.403615
H  -3.387895 -2.031911 1.867053
H  -4.991791 1.380034 -0.297032
H  -5.306981 -0.494649 1.346073
H  5.386546 0.671279 -0.879875
H  4.25016 -0.743275 -0.782254
H  5.45262 -0.478936 0.496891
