program: Gaussian 09
title: 000263190
version: EM64L-G09RevD.01
frameworkgroup: C1[X(C11H21NO)]
method: RPBEPBE
basis: SDD
operation: Freq
keyword: #p
keyword: freq=noraman
keyword: PBEPBE/SDD
title: #p freq=noraman PBEPBE/SDD
converged: NO YES NO NO
title: Mulliken charges:
elementType: O N C C C C C C C C C C C H H H H H H H H H H H H H H H H H H H H H
charge: -0.276169 -0.315855 -0.051851 -0.440977 -0.407128 -0.391224 -0.393640 -0.041195 -0.384793 -0.413211 -0.461347 -0.468318 -0.294503 0.199882 0.177311 0.219157 0.214459 0.178258 0.191764 0.197174 0.197543 0.189047 0.210791 0.198076 0.187598 0.205727 0.218708 0.232146 0.251560 0.213804 0.227647 0.219425 0.190906 0.219228
chargesum: 0.00000
title: Mulliken charges with hydrogens summed into heavy atoms:
elementType: O N C C C C C C C C C C C
charge: -0.276169 -0.083709 0.148031 -0.044509 -0.014411 -0.002285 -0.007050 0.169596 0.000880 0.011224 0.004016 -0.021246 0.115632
polarizability: 1.54227922e+02 -1.56506852e+00 1.13724487e+02 1.86762814e+00 -1.46728956e+00 1.06006540e+02
1716.lowfreq: -19.5878 -0.0009 -0.0008 -0.0006 5.5128 19.5906 29.1635 37.2520 63.0804
frequency: 28.2324 36.5621 62.8577 88.6333 118.3206 179.0408 204.1381 223.7834 231.6843 264.0409 324.5960 388.3284 406.8937 435.7832 460.9988 474.2881 556.4274 582.7657 654.8873 683.9859 777.9827 791.7045 823.1354 838.0908 844.8668 862.6409 877.4861 889.7662 894.0897 914.5250 917.6602 958.0368 984.2673 997.8747 1026.9218 1043.7772 1045.6115 1052.6517 1072.7100 1082.9565 1108.6251 1113.0332 1135.2151 1140.9401 1161.7600 1172.5020 1189.6880 1204.4005 1225.8134 1246.6468 1251.5027 1255.5321 1264.4914 1294.5083 1303.8724 1306.0993 1309.7634 1328.0323 1331.4544 1335.1618 1338.5124 1339.6361 1345.2441 1356.5222 1371.8419 1452.2431 1459.6701 1463.2810 1463.6757 1464.0543 1470.9232 1472.1196 1478.4887 1482.1304 1487.6063 2912.2741 2945.6718 2951.8199 2959.3694 2963.2776 2964.2962 2965.2107 2967.5644 2976.9398 3009.7689 3012.4371 3016.9812 3025.0161 3026.2643 3030.2755 3037.1153 3045.4348 3060.6304 3077.7365 3091.6520 3410.4506
redmass: 3.2013 3.3213 2.8363 4.0464 2.8152 3.0501 2.0396 1.9499 2.2214 3.9597 1.7540 2.2941 2.7184 2.7548 1.9183 2.9686 2.1352 1.9681 1.4892 4.2153 1.7005 1.8330 2.1120 2.6307 2.1607 2.4907 1.6842 1.6210 1.6296 2.5486 1.8696 2.1369 1.6188 2.1645 3.9039 1.7578 2.3047 1.1456 1.3527 1.5274 1.8103 2.4892 1.3126 3.2818 1.8496 1.8441 1.5606 1.3726 1.3809 1.2875 1.2631 1.2909 1.3186 1.3374 1.2991 1.2972 1.2492 1.3782 1.3184 1.3774 1.4595 1.4046 1.4109 1.4537 1.4839 1.2059 1.0920 1.0901 1.0906 1.0883 1.0862 1.0833 1.0953 1.0879 1.0968 1.0672 1.0761 1.0656 1.0673 1.0701 1.0626 1.0626 1.0631 1.0838 1.0666 1.0726 1.0811 1.0966 1.0963 1.0999 1.0998 1.0998 1.0970 1.1015 1.1047 1.0734
irintensity: 1.6846 1.0849 0.0984 2.5881 3.4514 1.6532 0.7992 0.2984 1.0751 8.2628 1.0420 0.4726 1.3252 1.8373 0.5993 7.1216 1.3230 4.8242 75.2557 22.4376 2.9517 2.1123 5.5095 8.4712 4.0947 12.0005 2.7138 19.2972 2.9454 9.6526 0.8923 8.3700 0.3252 14.4232 89.3998 2.0687 1.5010 0.7150 1.9477 9.1339 44.9834 0.2378 9.6489 52.1697 5.6605 3.4538 1.1541 3.0329 10.2184 0.8780 9.5687 2.6511 0.7574 5.5597 0.5226 0.9305 1.8895 6.4079 1.6414 0.5164 0.7761 10.2759 2.9241 1.1818 10.5554 25.0683 3.1345 8.2475 6.1225 12.5860 18.8508 16.9070 4.9238 6.0136 1.2610 56.7087 2.6700 18.0269 109.5660 21.2849 61.0678 34.9066 51.3414 25.8906 9.7365 39.0940 58.7288 93.1812 79.2050 1.5978 53.3207 102.3883 39.3165 23.4410 52.9890 1.6169
temp: 298.150 k
press: 1.00000 atm
elementType: 8 7 6 6 6 6 6 6 6 6 6 6 6 1 1 1 1 1 1 1 1 1 1 1 1 1 1 1 1 1 1 1 1 1
symmnumber: 1
zpe: 805554.4 jmol-1
zpe.correction: 0.306819 hartree
zpe.thermalcorrener: 0.320122 hartree
zpe.thermalcorrenthalpy: 0.321066 hartree
zpe.thermalcorrgfe: 0.265601 hartree
zpe.sumelectzpe: -560.660545 hartree
zpe.sumelectthermal: -560.647242 hartree
zpe.sumelectthermalent: -560.646298 hartree
zpe.sumelectthermalfe: -560.701763 hartree
dipole: -0.7189 1.0963 0.6405
dipole: 1.4590
quadrupole: -78.1319 -85.6368 -78.4480
quadrupole: 6.0178 4.3731 -1.5494
quadrupole: 2.6070 -4.8979 2.2909 6.0178 4.3731 -1.5494
hfenergy: -560.9673642 hartree
pointgroup: C01 [X(C11H21N1O1)]
dipole: -0.223835 0.3804774 -0.3669437 debye
polarizability: 153.5186255|-2.2078304|105.8812359|5.3951822|-1.1234324|114.5590877 unknown
InChI: InChI=1S/C11H21NO/c1-2-5-10(6-3-1)12-9-11-7-4-8-13-11/h10-12H,1-9H2
charge 0 multiplicity 1
34 atoms
O  3.197106 -1.138181 1.154976
N  -0.112438 -0.608718 -0.553095
C  -1.393359 0.102389 -0.309452
C  -2.2691 0.025929 -1.581679
C  -2.195009 -0.405389 0.925679
C  -3.606973 0.785552 -1.41209
C  -3.525318 0.36769 1.10187
C  2.279071 -0.996986 -0.01591
C  -4.392836 0.285678 -0.176154
C  0.909191 -0.523517 0.513226
C  2.961074 -0.000138 -0.984034
C  3.881758 0.831791 -0.052097
C  4.353685 -0.230366 0.960653
H  -1.137166 1.169558 -0.131622
H  -2.483442 -1.042527 -1.803259
H  -1.693897 0.424385 -2.438165
H  -1.578984 -0.317587 1.841639
H  -2.413151 -1.485952 0.783022
H  -3.397708 1.869239 -1.294866
H  -4.220058 0.677174 -2.327793
H  -4.082992 -0.026747 1.973521
H  -3.301833 1.432724 1.321998
H  2.168908 -2.001753 -0.471907
H  -5.321752 0.875043 -0.049059
H  -4.700215 -0.768193 -0.34032
H  0.986814 0.534798 0.831892
H  0.6792 -1.118515 1.426834
H  -0.283256 -1.585797 -0.835584
H  2.205511 0.599069 -1.518745
H  3.569595 -0.540912 -1.732104
H  4.719593 1.306408 -0.591142
H  3.304753 1.623817 0.459269
H  5.214109 -0.806667 0.560081
H  4.62032 0.177296 1.950918
