program: Gaussian 09
title: 000263174
version: EM64L-G09RevD.01
frameworkgroup: C1[X(C9H15NO)]
method: RPBEPBE
basis: SDD
operation: Freq
keyword: #p
keyword: freq=noraman
keyword: PBEPBE/SDD
title: #p freq=noraman PBEPBE/SDD
converged: YES YES NO NO
title: Mulliken charges:
elementType: O N C C C C C C C C C H H H H H H H H H H H H H H H
charge: -0.241009 -0.295687 -0.368579 -0.347046 -0.342278 -0.439073 0.306958 -0.689762 -0.409020 -0.263286 -0.183107 0.178025 0.213555 0.207842 0.175151 0.193776 0.191939 0.251290 0.209990 0.231324 0.216179 0.211693 0.208807 0.277036 0.249641 0.255639
chargesum: 0.00000
title: Mulliken charges with hydrogens summed into heavy atoms:
elementType: O N C C C C C C C C C
charge: -0.241009 -0.044397 0.023002 0.035946 0.043436 0.002241 0.306958 -0.053082 -0.131983 -0.013645 0.072532
polarizability: 1.42512961e+02 3.23870279e+00 9.87594592e+01 -4.98146825e+00 2.20784827e+00 7.23831292e+01
1716.lowfreq: -10.6166 -9.0953 0.0003 0.0004 0.0006 4.1017 28.7023 45.8784 55.5673
frequency: 28.3282 45.7812 55.4022 77.4006 119.3309 137.8359 152.7192 223.7416 245.8257 253.7402 302.6029 432.6459 473.4836 593.3313 615.5757 681.0697 716.1094 719.5358 737.6776 802.2187 822.8557 869.0449 877.9967 893.6833 899.0201 932.7547 965.1726 1000.4432 1027.0089 1037.6245 1043.4407 1080.1834 1123.4416 1128.8607 1135.8814 1149.0401 1170.7505 1206.3574 1214.7930 1237.3938 1270.0913 1278.0842 1284.8948 1325.0806 1346.2096 1363.4547 1387.7179 1396.8981 1450.6678 1467.1210 1472.8322 1476.1060 1479.4602 1486.1071 1491.4560 1496.3329 1593.4591 2846.2557 2869.2503 2957.1714 2967.6032 2972.2484 2973.3562 2990.1745 3007.2741 3039.4580 3070.1074 3073.3255 3219.4824 3242.8078 3267.3182 3436.2172
redmass: 4.1095 1.7678 3.8717 2.8266 1.9023 2.4916 3.6005 1.1252 4.6220 3.1815 3.4614 3.1090 3.9352 3.3965 3.4744 1.4147 2.5658 1.4598 1.0730 1.1404 1.2339 6.3316 1.3531 1.8945 3.4881 1.1873 1.8904 1.6767 2.9972 2.3865 2.5289 2.2773 2.3135 1.5613 1.5457 3.5472 2.4854 1.5134 1.5854 1.3093 1.3168 1.1592 1.0801 1.4987 1.7346 1.8186 1.2386 1.5832 1.2144 1.0694 1.0700 1.0429 1.1432 1.1189 3.2974 1.1283 6.7214 1.0711 1.0704 1.0632 1.0612 1.0861 1.0362 1.0838 1.0981 1.1018 1.1007 1.0994 1.0914 1.0991 1.1083 1.0744
irintensity: 0.1702 0.4878 0.0598 1.3587 2.7331 2.4550 1.6665 0.1529 1.0595 7.5600 1.3359 2.2797 0.4634 6.4674 6.0048 91.2400 15.8961 71.0092 12.2152 0.3673 37.8442 3.8743 1.4694 3.7911 19.5460 2.4623 8.9275 20.0946 1.8350 8.3094 3.3447 1.2085 3.5089 3.4481 35.2464 47.1182 10.3557 1.3389 6.3115 3.2880 1.7948 2.4120 0.2055 12.7827 5.9655 5.9929 9.7765 0.0644 42.8460 2.2034 2.2404 12.7844 11.7274 4.2394 14.2951 5.1162 9.2971 95.1057 99.8410 6.0684 54.2092 27.6680 36.1447 47.0434 1.8537 48.0186 88.8619 54.4072 4.9988 0.4346 0.8082 0.3986
temp: 298.150 k
press: 1.00000 atm
elementType: 8 7 6 6 6 6 6 6 6 6 6 1 1 1 1 1 1 1 1 1 1 1 1 1 1 1
symmnumber: 1
zpe: 587534.7 jmol-1
zpe.correction: 0.223780 hartree
zpe.thermalcorrener: 0.236033 hartree
zpe.thermalcorrenthalpy: 0.236977 hartree
zpe.thermalcorrgfe: 0.183367 hartree
zpe.sumelectzpe: -481.023155 hartree
zpe.sumelectthermal: -481.010902 hartree
zpe.sumelectthermalent: -481.009958 hartree
zpe.sumelectthermalfe: -481.063568 hartree
dipole: -0.9088 0.0768 -0.5056
dipole: 1.0428
quadrupole: -62.7021 -66.8582 -68.6155
quadrupole: 3.6414 -0.7148 -0.4888
quadrupole: 3.3565 -0.7996 -2.5569 3.6414 -0.7148 -0.4888
hfenergy: -481.2469356 hartree
pointgroup: C01 [X(C9H15N1O1)]
dipole: 0.3567191 0.0021487 -0.2026653 debye
dipolederiv: -0.4249176 -0.053196 -0.0251738 0.0000906 -0.6562093 0.0102553 -0.0340444 -0.0048134 -0.1328734 -0.854835 -0.0217707 0.015993 -0.0423227 -0.5652201 0.0310039 0.0569373 0.0481733 -0.164272 -0.1082994 0.011511 -0.0016705 -0.0127331 0.0577264 -0.0424764 0.0095944 -0.0236018 0.1729635 0.5446292 0.1725442 0.0401219 0.1839832 0.368355 -0.0794023 0.1594768 -0.075779 0.2651768 0.0571872 0.0205617 0.0085921 0.0756073 0.1135511 -0.0382189 0.0437656 -0.0420424 0.155352 0.4521362 -0.0919359 -0.0361197 -0.1781491 0.3804067 -0.0453748 -0.2935596 -0.0532359 0.2994176 0.2973935 -0.0033979 0.0662257 -0.0060868 0.3458837 -0.0122477 0.1971415 0.0583294 -0.0164167 -0.0546604 0.0554792 0.0253639 0.0201299 0.0499931 -0.0231333 0.0065628 -0.0233124 0.0841158 -0.0876816 -0.067403 0.0305687 -0.122425 -0.1718105 -0.022317 -0.0077225 -0.0394514 -0.2091443 0.0296605 0.0699731 0.0474728 0.014968 -0.0741652 0.0077704 0.0529653 0.0163174 -0.2066401 -0.0328155 0.0573185 0.0324194 0.1373129 0.3303446 0.0138645 0.0210544 0.0098162 -0.16219 0.0331065 -0.008559 -0.0329676 0.0101653 0.0543515 -0.0322594 -0.0362534 -0.0572519 -0.1959543 0.0578078 -0.0286919 0.006264 -0.0157371 -0.1345963 0.0700951 0.0063911 0.0847229 0.0354949 0.0221433 -0.0085026 0.0053605 -0.0309559 0.0422175 -0.0250243 -0.0315686 -0.0483976 -0.1803495 -0.109464 -0.046221 0.0036827 -0.1609043 -0.2496865 0.0759996 0.0305193 0.117663 0.0012412 0.0302918 0.0076208 0.0091207 -0.0040943 0.0584584 -0.0453038 -0.0299461 -0.0678413 -0.1956398 0.0298183 0.0076289 0.0033216 -0.0327213 -0.1740371 0.0795391 0.0137895 0.1040371 0.0356161 0.1475832 0.02375 0.0044524 0.0290089 0.2492003 0.005834 -0.0167996 -0.0789014 -0.0247349 -0.0652614 0.0205476 0.0025332 0.1190284 -0.2120121 0.0663092 0.0139609 0.1221549 0.0239929 -0.0439761 -0.056636 -0.0698378 0.0041326 0.0443325 -0.0348223 -0.0399794 -0.077564 -0.1269606 -0.2159937 -0.0504398 -0.0351898 -0.0818552 0.0546073 -0.0269552 -0.0509204 -0.0260898 0.0844456 0.0855359 -0.039937 0.0311428 0.0257282 -0.1427902 0.0849383 0.0159997 0.1070993 0.0361345 0.0861384 0.0067022 -0.0421649 0.027216 0.0700574 -0.0277461 0.019792 -0.0523893 -0.1834844 0.0778774 0.0790317 -0.0235766 0.0961585 0.0651417 0.0159857 -0.0338596 0.0129411 0.1894336 0.0389172 -0.0856389 -0.0267292 -0.1013449 0.0227549 -0.0169418 -0.0240803 -0.0165803 0.195289 0.0076783 0.0296609 -0.0392053 0.0458002 0.0731454 0.0106283 -0.049217 0.0059976 0.2199865 unknown
polarizability: 142.6294255|1.4326466|98.5496607|5.2379604|2.8325027|72.4764636 unknown
InChI: InChI=1S/C9H15NO/c1-2-3-6-10-8-9-5-4-7-11-9/h4-5,7,10H,2-3,6,8H2,1H3
charge 0 multiplicity 1
26 atoms
O  -3.033239 1.062816 -0.045542
N  0.532726 0.103527 -0.002305
C  2.983164 -0.295809 -0.168338
C  1.868964 0.650234 0.318392
C  4.401164 0.231156 0.147622
C  -0.600077 0.94792 0.429216
C  -1.901974 0.242666 0.176888
C  5.514206 -0.717305 -0.347472
C  -2.280112 -1.088451 0.111755
C  -3.705781 -1.11798 -0.158291
C  -4.127946 0.196293 -0.24311
H  2.887139 -0.444091 -1.265486
H  2.834131 -1.288751 0.298843
H  1.936869 0.762576 1.419638
H  2.036559 1.669294 -0.117216
H  4.500146 0.377933 1.242538
H  4.53426 1.230993 -0.314099
H  0.451543 -0.152751 -0.996282
H  -0.639627 1.950846 -0.064836
H  -0.474889 1.14513 1.514185
H  6.518415 -0.321709 -0.108529
H  5.422592 -1.714737 0.122085
H  5.457835 -0.856863 -1.443672
H  -1.612563 -1.935477 0.249643
H  -4.330069 -2.002241 -0.272168
H  -5.08333 0.680177 -0.424657
