program: Gaussian 09
title: 000024300
version: EM64L-G09RevD.01
frameworkgroup: C1[X(C16H34O2S2)]
method: RPBEPBE
basis: SDD
operation: Freq
keyword: #p
keyword: freq=noraman
keyword: PBEPBE/SDD
title: #p freq=noraman PBEPBE/SDD
converged: NO YES NO NO
title: Mulliken charges:
elementType: S S O O C C C C C C C C C C C C C C C C H H H H H H H H H H H H H H H H H H H H H H H H H H H H H H H H H H
charge: 0.845491 0.019055 -0.516206 -0.532096 -0.374791 -0.380174 -0.307037 -0.371643 -0.379871 -0.366230 -0.628525 -0.370819 -0.287227 -0.353529 -0.352810 -0.769678 -0.355976 -0.356096 -0.694756 -0.695924 0.202853 0.203315 0.200966 0.201974 0.241657 0.234349 0.191626 0.192058 0.192015 0.193141 0.192079 0.203691 0.280496 0.283081 0.192314 0.189966 0.204064 0.210289 0.190747 0.190290 0.187823 0.187736 0.326100 0.281330 0.195225 0.195469 0.195292 0.195789 0.210508 0.210709 0.216793 0.209521 0.215934 0.209641
chargesum: 0.00000
title: Mulliken charges with hydrogens summed into heavy atoms:
elementType: S S O O C C C C C C C C C C C C C C C C
charge: 0.845491 0.019055 -0.516206 -0.532096 0.031377 0.022766 0.168969 0.012042 0.005285 0.029539 -0.064947 0.011461 0.127126 0.027507 0.022748 -0.162249 0.034719 0.034985 -0.056746 -0.060827
polarizability: 3.26981336e+02 8.15366841e+00 2.23777371e+02 1.25735372e+01 3.99903697e+00 1.91608706e+02
1716.lowfreq: -18.5709 -13.6362 -5.1753 0.0012 0.0019 0.0024 4.4255 9.5420 15.1989
frequency: -10.6397 4.7467 14.7142 27.9186 29.8858 38.1757 46.5945 54.8725 55.2839 76.7425 81.8904 91.6233 94.3061 98.0370 126.2545 134.7786 137.2673 138.0171 139.6739 145.7685 157.2814 166.4089 194.5389 220.9749 230.9867 231.1851 240.9663 265.6815 273.3843 294.3216 298.6974 355.8645 358.5046 427.0964 432.6094 435.5558 473.6297 489.4174 592.9057 678.5876 722.4931 723.3605 728.6381 731.7544 740.6535 755.7076 777.9311 786.4474 800.5098 842.9615 846.5930 888.9209 889.5038 903.8487 922.2175 938.1345 987.0785 987.5523 998.1490 1005.2966 1009.3098 1015.9246 1036.1229 1038.1563 1060.5986 1063.8198 1070.2917 1070.7022 1074.6970 1076.8684 1084.3005 1090.1122 1117.5957 1118.7149 1185.3661 1187.4215 1213.1343 1213.4835 1219.3184 1224.1549 1244.4062 1253.9872 1256.9820 1264.2201 1279.8959 1281.9199 1282.9258 1285.0569 1285.7591 1292.9558 1295.4810 1295.6333 1298.7509 1299.6926 1318.8334 1323.2117 1339.9225 1343.4233 1350.3687 1354.1332 1354.2143 1354.9556 1389.1069 1390.3984 1406.9655 1430.3661 1461.1199 1461.4329 1462.1141 1463.1121 1465.8528 1466.3029 1470.9556 1471.4131 1476.9359 1477.0629 1478.2985 1478.5178 1485.1527 1485.6162 1488.8085 1490.7730 2910.0663 2951.4359 2952.4705 2953.0921 2955.9914 2957.6623 2962.0348 2963.8592 2967.3194 2969.0836 2971.7386 2972.1436 2972.8216 2982.1050 2985.7143 2988.6282 2994.4853 3000.1574 3002.1974 3007.0735 3011.4426 3021.3582 3028.1779 3035.0332 3043.1010 3044.7731 3045.3656 3065.4095 3068.2899 3068.6175 3069.3843 3071.3673 3072.7351 3136.2333
redmass: 2.3142 2.9519 4.9134 3.9126 3.5572 3.8329 3.0511 1.6046 4.1514 3.6731 2.1136 1.8848 2.4771 2.2722 5.2093 1.8813 2.6357 2.1917 2.4063 2.3180 6.5124 4.1403 3.4815 4.4613 1.1142 1.1209 6.3033 3.7745 3.5820 5.0919 4.3791 4.6904 5.4840 3.3063 3.4419 5.4575 3.0674 4.2744 5.4588 5.9855 1.0629 1.0629 1.0784 1.0841 1.1281 1.1105 1.1904 1.3039 7.3614 1.2355 1.3045 1.8973 1.8933 2.6755 1.2268 1.5780 4.9594 4.9527 1.1486 1.1880 3.7058 3.8428 3.5443 3.3872 2.8971 2.9003 2.6437 2.3786 2.2884 2.2872 1.1876 1.1852 2.5669 2.5761 1.7917 1.7547 1.2457 1.2586 1.4558 1.4099 1.2481 1.2720 1.2905 1.2677 1.0246 1.2245 1.0590 1.1731 1.1759 1.1177 1.1499 1.0826 1.1157 1.1504 1.3245 1.2876 1.3979 1.4441 1.5179 1.5827 1.6308 1.6324 1.2163 1.2187 1.1084 1.0750 1.0702 1.0734 1.0739 1.0704 1.0714 1.0692 1.0773 1.0775 1.0426 1.0429 1.0784 1.0788 1.0878 1.0871 1.0938 1.0933 1.0686 1.0589 1.0588 1.0589 1.0589 1.0593 1.0588 1.0593 1.0591 1.0589 1.0586 1.0365 1.0363 1.0595 1.0965 1.0974 1.0989 1.0996 1.0589 1.1017 1.1025 1.1035 1.1046 1.1034 1.1049 1.0599 1.0973 1.0973 1.1006 1.1039 1.1018 1.0993 1.0992 1.1104
irintensity: 0.0791 0.5163 0.0763 0.5519 1.8339 0.4769 0.0483 0.2828 2.0692 0.0765 0.5532 0.2275 0.1274 0.0085 6.9826 0.0570 0.4513 0.1074 0.3240 0.9112 0.4626 0.8108 3.2832 2.0623 0.0135 0.0031 0.8446 0.7188 7.9808 19.7368 10.4828 7.1007 14.7156 1.2798 8.2280 48.8845 0.7616 26.1566 1.7657 4.6269 13.5214 13.5931 2.0017 0.5172 2.7478 5.2130 1.5825 3.8510 48.1974 0.9002 2.0911 6.6763 5.9905 50.7957 0.8385 15.5084 0.3870 0.8348 0.3662 3.8446 11.8110 0.5706 2.9474 0.7990 2.3254 3.0990 0.1885 0.0574 0.3745 2.1953 3.2514 0.9489 43.3083 14.4028 0.3839 0.8976 7.9222 8.7022 0.0029 3.6624 11.9424 5.7064 0.1418 1.0404 0.4177 9.6152 3.4758 0.1161 9.1110 1.3691 1.9010 0.0235 0.1943 0.4732 12.7027 8.7543 13.7624 3.2655 0.9867 0.4581 0.2831 0.6065 11.1321 11.0875 4.5692 15.3109 0.2308 0.5023 0.2399 0.1169 1.6879 1.8767 1.7141 0.5558 12.1969 12.5460 2.9879 2.5588 1.7739 2.7539 31.8434 28.3983 2.6775 0.7521 0.3052 0.6116 5.3620 3.3010 0.8812 15.6193 14.9275 130.5227 138.4986 39.9193 46.9916 51.5666 0.7572 0.1950 0.1929 0.3897 16.4784 0.2366 1.1878 0.3365 3.4599 33.7951 99.0190 2.3109 109.2489 33.2942 99.3754 0.4518 130.5120 55.7723 53.1342 2.9816
temp: 298.150 k
press: 1.00000 atm
elementType: 16 16 8 8 6 6 6 6 6 6 6 6 6 6 6 6 6 6 6 6 1 1 1 1 1 1 1 1 1 1 1 1 1 1 1 1 1 1 1 1 1 1 1 1 1 1 1 1 1 1 1 1 1 1
symmnumber: 1
zpe: 1241492.9 jmol-1
zpe.correction: 0.472860 hartree
zpe.thermalcorrener: 0.500630 hartree
zpe.thermalcorrenthalpy: 0.501574 hartree
zpe.thermalcorrgfe: 0.407556 hartree
zpe.sumelectzpe: -1574.850701 hartree
zpe.sumelectthermal: -1574.822931 hartree
zpe.sumelectthermalent: -1574.821986 hartree
zpe.sumelectthermalfe: -1574.916004 hartree
dipole: 0.6758 4.2541 -2.6170
dipole: 5.0402
quadrupole: -125.4224 -163.3086 -149.6090
quadrupole: 7.2883 -3.2236 6.5838
quadrupole: 20.6910 -17.1953 -3.4957 7.2883 -3.2236 6.5838
hfenergy: -1575.3235602 hartree
pointgroup: C01 [X(C16H34O2S2)]
dipole: 0.2422829 -1.1405373 -1.6039206 debye
polarizability: 326.559142|12.4174999|191.2972459|-10.7451811|-2.0152812|224.5110256 unknown
InChI: InChI=1S/C8H17O2S.C8H17S/c1-2-3-4-5-6-7-8-11(9)10;1-2-3-4-5-6-7-8-9/h2-8H2,1H3;2-8H2,1H3
charge 0 multiplicity 1
54 atoms
S  0.629432 0.702416 3.34039
S  -1.108287 -0.902775 4.075999
O  1.599159 1.186576 4.555009
O  -0.165828 1.825126 2.44485
C  3.7626 -0.469663 0.682833
C  5.013273 0.284556 0.173974
C  2.903164 0.407094 1.632297
C  5.881564 -0.568019 -0.777935
C  -5.027744 -0.527219 0.319116
C  -4.33335 0.18397 1.502603
C  1.689935 -0.377661 2.123941
C  -6.177363 0.301318 -0.296894
C  -3.178173 -0.650218 2.106343
C  7.139907 0.175209 -1.28043
C  -6.885822 -0.413101 -1.46947
C  -2.51844 0.071555 3.292913
C  8.007091 -0.673763 -2.237648
C  -8.033058 0.418132 -2.087484
C  9.264346 0.073381 -2.731823
C  -8.739827 -0.302882 -3.255191
H  4.080414 -1.391253 1.21181
H  3.151798 -0.793961 -0.184232
H  4.696653 1.211301 -0.347099
H  5.625006 0.606768 1.041527
H  3.515468 0.727893 2.495928
H  2.573284 1.318547 1.099184
H  5.271124 -0.88403 -1.649674
H  6.190265 -1.499907 -0.259605
H  -5.424117 -1.506404 0.660323
H  -4.276193 -0.75184 -0.466198
H  -5.084951 0.40065 2.290313
H  -3.941894 1.165318 1.164281
H  0.958926 -0.636498 1.341287
H  1.943578 -1.257653 2.737896
H  -5.77954 1.276107 -0.648805
H  -6.922328 0.537078 0.491886
H  -2.413429 -0.843423 1.328467
H  -3.564441 -1.637751 2.42731
H  7.754665 0.48757 -0.410458
H  6.834512 1.10966 -1.796032
H  -7.288394 -1.386468 -1.11825
H  -6.141958 -0.652054 -2.258427
H  -2.063317 1.032135 2.959982
H  -3.230262 0.28976 4.107958
H  7.392813 -0.982914 -3.108014
H  8.309147 -1.608887 -1.723161
H  -8.773496 0.659676 -1.297566
H  -7.629536 1.389098 -2.440822
H  8.988644 0.994251 -3.279621
H  9.908355 0.369898 -1.8824
H  9.86909 -0.555286 -3.410748
H  -8.02846 -0.524195 -4.073247
H  -9.557399 0.311132 -3.675616
H  -9.17581 -1.26385 -2.922269
