program: Gaussian 09
title: 000263170
version: EM64L-G09RevD.01
frameworkgroup: C1[X(C8H16O2)]
method: RPBEPBE
basis: SDD
operation: Freq
keyword: #pfreq=noraman
keyword: PBEPBE/SDD
title: #p freq=noraman PBEPBE/SDD
converged: YES YES NO NO
title: Mulliken charges:
elementType: O O C C C C C C C C H H H H H H H H H H H H H H H H
charge: -0.251518 -0.298318 -0.422953 -0.407468 -0.002227 -0.383382 -0.308884 0.072675 -0.699199 -0.681666 0.216726 0.201123 0.203904 0.223231 0.213529 0.205943 0.198617 0.213184 0.198762 0.216003 0.200773 0.223882 0.220818 0.208439 0.216597 0.221409
chargesum: 0.00000
title: Mulliken charges with hydrogens summed into heavy atoms:
elementType: O O C C C C C C C C
charge: -0.251518 -0.298318 -0.005103 0.029292 0.201677 0.021178 0.103061 0.288677 -0.053725 -0.035221
polarizability: 1.06457233e+02 -1.15153779e+00 8.85549547e+01 -2.40322565e-01 6.85312519e-01 7.96800742e+01
1716.lowfreq: -25.3138 -14.7709 0.0008 0.0009 0.0009 14.8491 31.7177 67.2217 110.5772
frequency: 29.1475 66.6492 110.4937 166.6518 186.7718 215.4285 241.4481 264.7253 330.6437 382.4227 400.2389 420.0046 445.3545 499.1712 538.9549 650.4465 762.7050 780.3530 821.7801 847.7726 870.1355 884.5782 916.6673 926.5319 937.0627 943.2893 1005.6935 1021.0404 1050.3717 1102.6325 1107.6540 1123.9018 1150.4033 1170.7141 1177.9687 1185.7678 1253.3667 1270.7038 1294.2232 1322.1185 1335.0307 1340.3913 1344.1574 1349.3925 1356.2402 1363.7408 1377.2790 1391.8748 1444.8870 1453.9462 1456.2769 1460.0672 1463.4878 1471.0530 1474.8054 1485.1294 2978.6737 2980.5928 2980.8274 2986.5858 2987.6463 2993.2547 2997.0280 3009.6725 3040.7873 3056.9340 3070.5872 3074.9346 3080.2401 3083.8877 3089.7009 3093.8556
redmass: 2.7033 3.3939 3.0612 3.2491 1.0395 1.5956 1.7687 1.8160 1.8916 2.2439 3.1961 3.3812 2.7661 2.4193 3.0958 2.9199 3.7750 2.4209 1.9016 2.8371 2.6706 2.2523 1.2772 1.7470 1.4332 2.5249 2.6642 2.4753 1.9303 1.7073 2.1490 2.0553 2.1130 1.3916 1.5873 1.6654 1.2364 1.2202 1.2031 1.2945 1.2539 1.3856 1.4092 1.4849 1.3940 1.2757 1.2884 1.2321 1.0918 1.0880 1.0527 1.0817 1.0495 1.0514 1.0900 1.0482 1.0654 1.0363 1.0593 1.0758 1.0437 1.0700 1.0628 1.0771 1.1002 1.1008 1.1025 1.0988 1.1011 1.1005 1.0995 1.0998
irintensity: 0.4218 1.2010 4.0848 3.0459 0.0479 3.2864 2.9293 1.8392 2.3871 2.6074 6.6507 10.9918 0.0625 1.3758 3.5263 1.1889 33.3460 1.0902 5.6007 13.3894 6.8357 52.5210 12.6911 38.9520 11.5259 159.3922 44.3075 42.0322 12.1534 56.4199 19.8332 15.0628 10.6348 6.6798 40.2520 3.5701 6.1386 8.0388 24.8117 4.4239 2.0374 0.1729 1.6399 6.6964 2.1965 1.3061 35.4157 21.7912 7.3050 11.8092 3.4032 8.6326 1.0218 9.0295 10.5006 14.4092 38.5176 29.0630 32.5385 13.2069 23.3515 7.1558 53.0096 69.4557 35.0810 45.9175 41.3682 28.0786 51.3880 13.4530 54.8107 49.2517
temp: 298.150 k
press: 1.00000 atm
elementType: 8 8 6 6 6 6 6 6 6 6 1 1 1 1 1 1 1 1 1 1 1 1 1 1 1 1
symmnumber: 1
zpe: 603808.8 jmol-1
zpe.correction: 0.229979 hartree
zpe.thermalcorrener: 0.241071 hartree
zpe.thermalcorrenthalpy: 0.242015 hartree
zpe.thermalcorrgfe: 0.192899 hartree
zpe.sumelectzpe: -464.051662 hartree
zpe.sumelectthermal: -464.040569 hartree
zpe.sumelectthermalent: -464.039625 hartree
zpe.sumelectthermalfe: -464.088742 hartree
dipole: 0.0025 0.1076 0.4302
dipole: 0.4435
quadrupole: -56.6372 -59.4329 -66.5146
quadrupole: -0.0173 -2.1243 1.0438
quadrupole: 4.2244 1.4287 -5.6530 -0.0173 -2.1243 1.0438
hfenergy: -464.2816402 hartree
pointgroup: C01 [X(C8H16O2)]
dipole: -0.0020657 0.013493 -0.1739406 debye
dipolederiv: -0.8675807 -0.1497806 0.0146 -0.3638807 -0.7699989 -0.0398225 -0.0859055 0.0010261 -0.4559174 -1.3787997 0.0773473 -0.1536227 0.2931408 -0.5403562 0.0737411 -0.2793143 -0.0191087 -0.4654731 -0.0654458 0.02286 0.0834923 0.0084182 -0.0077211 -0.033435 0.0465722 -0.0684482 0.0436677 0.0918996 -0.0302826 0.0236763 -0.010621 0.0404839 -0.0040619 -0.0114908 0.0001089 0.0806504 1.21564 0.0494445 0.1665953 0.1583868 0.7730125 0.0479251 0.6489449 0.1210705 0.5386756 0.0073095 0.0108964 0.0757162 0.017498 -0.0027399 -0.0829723 0.0946107 -0.0436055 0.0742546 0.5370828 0.1122546 -0.0549491 0.1199541 0.4181459 -0.0564969 -0.1478416 -0.1722199 0.3206178 0.9028192 -0.0396049 -0.0080341 -0.1764403 0.4151786 -0.0764574 -0.1815067 -0.0312447 0.2641138 -0.0305648 0.0133584 -0.0263701 0.0645381 -0.0190532 0.103794 -0.0414484 0.1071713 -0.0372889 -0.1250625 -0.0606391 0.0353094 -0.0858975 -0.079374 0.1090698 0.0953891 0.0733661 0.020861 0.0406148 -0.1010734 -0.0268273 -0.0963296 -0.0967918 -0.0602168 -0.0233631 -0.0995112 0.0389358 -0.0626053 0.0811286 -0.0825562 0.0471992 0.0511733 0.0512752 -0.0697343 0.0947022 -0.0691986 -0.0673047 -0.0685511 0.0918898 -0.0582131 -0.0496807 0.0610229 0.024892 0.0991398 -0.1106198 0.031818 0.0062655 -0.1259531 0.0107751 0.023537 0.0702069 -0.0937938 0.0433917 -0.0593428 -0.1067718 0.1039601 0.1093713 0.1003128 -0.0273145 -0.0763379 0.0970403 -0.0659442 0.0255402 -0.0423015 0.0383454 -0.0923127 0.0884106 0.0294762 0.0339545 -0.1469986 0.0135479 -0.0621012 -0.0253917 -0.0982296 0.0770982 -0.1044765 -0.0461574 0.0833739 0.1244435 0.1087093 -0.0152268 0.0225487 -0.0693689 -0.0106738 -0.0647353 -0.0996417 -0.0900907 -0.0170258 -0.1282392 -0.0106509 -0.0584855 0.0764853 -0.0744325 0.0340649 0.0076129 0.0507752 -0.0372726 0.1399855 -0.0834302 0.0053114 -0.0341259 -0.0494257 0.0033389 -0.0594981 -0.0603693 0.0282552 -0.0856684 -0.0692938 -0.1317957 0.119284 0.0312364 0.1118597 0.0486888 -0.011727 0.0571277 -0.0338011 0.0611855 0.0051512 -0.1409925 0.0622041 -0.1186869 -0.0370963 0.0652531 0.0377574 0.0633849 0.0495148 0.094986 -0.016076 -0.0323633 -0.0450799 -0.0087624 -0.1381648 -0.0541888 -0.0692045 -0.0515992 -0.1397019 0.0700086 0.0777075 0.0931283 0.0400659 -0.0527302 0.0835555 -0.0335759 0.0750873 0.0739016 0.0653197 -0.0973491 0.0354038 -0.0068455 0.1098181 -0.0773343 0.1141957 -0.0512742 0.0727289 -0.0382338 -0.0140269 -0.0620683 0.0036567 -0.0773272 -0.0713697 -0.1292284 -0.0516875 unknown
polarizability: 106.4547896|1.046299|88.0785047|-0.6012192|-2.1125652|80.1589676 unknown
InChI: InChI=1S/C8H16O2/c1-7(2)10-8-5-3-4-6-9-8/h7-8H,3-6H2,1-2H3
charge 0 multiplicity 1
26 atoms
O  0.694901 0.471304 1.27883
O  -0.796215 -0.408645 -0.416241
C  1.283047 -1.563035 -0.04044
C  2.124413 -0.695923 -1.006236
C  0.171318 -0.736368 0.624462
C  2.656263 0.556247 -0.267771
C  1.483521 1.329601 0.359978
C  -2.049162 0.23164 0.082643
C  -2.601339 1.035475 -1.100396
C  -3.030514 -0.844276 0.5826
H  0.82302 -2.417381 -0.568412
H  1.931074 -1.964117 0.762527
H  -0.311479 -1.279266 1.460725
H  1.489455 -0.381261 -1.855893
H  2.961139 -1.290223 -1.417672
H  3.36358 0.252284 0.528819
H  3.20289 1.2220 -0.964055
H  1.825209 2.164273 0.994063
H  0.816233 1.721009 -0.434758
H  -1.773605 0.914303 0.912186
H  -3.545556 1.538845 -0.823163
H  -1.874928 1.801843 -1.422119
H  -2.799576 0.366441 -1.957012
H  -3.952418 -0.374081 0.972971
H  -2.590431 -1.447372 1.397288
H  -3.305839 -1.524117 -0.243327
