program: Gaussian 09
title: 000263166
version: EM64L-G09RevD.01
frameworkgroup: C1[X(C8H9ClO3)]
method: RPBEPBE
basis: SDD
operation: Freq
keyword: #p
keyword: freq=noraman
keyword: PBEPBE/SDD
title: #p freq=noraman PBEPBE/SDD
converged: YES YES NO NO
title: Mulliken charges:
elementType: Cl O O O C C C C C C C C H H H H H H H H H
charge: -0.068802 -0.215281 -0.279014 -0.228020 0.192468 0.470116 -0.308258 -0.350496 0.178193 -0.254680 -0.752864 -0.663517 0.283070 0.267649 0.223628 0.236205 0.277603 0.292105 0.219114 0.253357 0.227424
chargesum: 0.00000
title: Mulliken charges with hydrogens summed into heavy atoms:
elementType: Cl O O O C C C C C C C C
charge: -0.068802 -0.215281 -0.279014 -0.228020 0.192468 0.470116 -0.025187 -0.082847 0.178193 0.205154 -0.183157 0.036378
polarizability: 1.71583791e+02 -1.70070851e+00 9.63998472e+01 2.84404648e+00 6.83252183e+00 7.32373814e+01
1716.lowfreq: -11.6111 -0.0020 -0.0017 -0.0013 2.7425 4.4438 35.7604 42.1819 57.3561
frequency: 35.7346 42.1703 57.3539 91.2536 110.3907 122.6609 179.5598 210.6278 266.1996 310.3053 321.2284 358.4534 435.8913 483.2225 562.5395 591.4519 668.3145 704.1336 717.7064 727.6864 811.6668 820.6224 826.6829 874.2497 903.0355 925.8533 941.3196 1004.0211 1025.6629 1076.5367 1095.3889 1106.6118 1154.9510 1211.0809 1229.1994 1242.7327 1279.1249 1279.3063 1355.6423 1357.5182 1391.6426 1439.1347 1456.8024 1462.8659 1484.2001 1506.7783 1568.9001 1646.7139 2993.7999 3029.5450 3085.4433 3088.7726 3094.4419 3120.1468 3170.2742 3228.0873 3253.2508
redmass: 4.4422 5.1955 4.6037 4.6939 7.6175 2.7973 8.2987 1.2731 2.8558 2.9544 6.1205 4.4832 3.6918 5.3316 7.6372 5.3938 4.9566 5.0245 6.4227 3.6743 1.3371 3.3307 1.3513 1.9343 1.4006 4.8539 4.6598 2.4370 1.4149 3.4964 2.1592 1.4162 1.6663 1.5081 3.2624 1.2969 1.2596 3.2138 1.3020 3.2671 1.2303 1.1447 1.1098 1.0456 1.0589 6.8431 6.6780 10.5119 1.0362 1.0598 1.0574 1.0973 1.1033 1.1057 1.1113 1.0958 1.1032
irintensity: 0.9136 1.2041 3.8519 0.7282 1.5580 3.6784 1.0353 3.2877 3.4120 14.9363 8.4841 6.6086 1.9766 1.8113 60.6998 2.4226 46.9739 16.4343 21.2900 6.9224 2.2730 2.8834 51.5688 1.7674 0.9618 21.0747 9.8297 29.0506 50.1009 335.8107 10.7700 21.8746 43.2363 98.3159 125.0583 100.1195 2.0491 36.4094 2.6587 3.6957 24.2058 6.2332 20.3942 13.3667 13.7035 53.2889 8.2981 228.1100 20.1831 34.4202 9.5572 37.5138 0.3865 30.8475 0.7897 1.3029 0.5767
temp: 298.150 k
press: 1.00000 atm
elementType: 17 8 8 8 6 6 6 6 6 6 6 6 1 1 1 1 1 1 1 1 1
symmnumber: 1
zpe: 409953.6 jmol-1
zpe.correction: 0.156143 hartree
zpe.thermalcorrener: 0.168453 hartree
zpe.thermalcorrenthalpy: 0.169397 hartree
zpe.thermalcorrgfe: 0.115270 hartree
zpe.sumelectzpe: -995.063302 hartree
zpe.sumelectthermal: -995.050992 hartree
zpe.sumelectthermalent: -995.050048 hartree
zpe.sumelectthermalfe: -995.104175 hartree
dipole: -1.4669 3.8629 0.1611
dipole: 4.1352
quadrupole: -65.1454 -77.2782 -77.7795
quadrupole: 5.4143 -7.9955 -0.8558
quadrupole: 8.2556 -3.8771 -4.3785 5.4143 -7.9955 -0.8558
hfenergy: -995.2194451 hartree
pointgroup: C01 [X(C8H9Cl1O3)]
dipole: -0.4586223 1.0007832 -1.1978654 debye
dipolederiv: -0.5188683 0.0502678 -0.1735075 -0.0505965 -0.1751585 -0.0809989 -0.6324403 0.0547207 -0.603535 -0.0704492 0.040232 0.0414168 -0.0361736 -0.4961239 0.1726767 -0.0126879 0.17639 -0.1882267 -1.789848 0.1713341 -0.0177831 0.4695741 -0.5246953 0.0878956 -0.2199234 0.0987581 -0.3877334 -0.7588609 -0.1623786 0.0405281 -0.1247076 -0.8751762 0.1533614 0.0452998 0.2095442 -0.3643435 -0.7392158 -0.2542243 -0.0211768 -0.4371544 0.0478479 -0.006068 0.1530338 -0.0223251 0.0311012 -0.2469038 0.0606095 -0.0877129 0.1387717 0.1917618 -0.0563587 0.1675469 -0.1663067 0.0116675 0.1479691 -0.0077009 -0.0140145 0.0691992 -0.0231638 -0.0767509 -0.0188863 -0.0475749 -0.1036934 -0.1525954 0.0507319 -0.0025609 0.1575839 -0.0265748 -0.0663121 -0.0789435 -0.0407053 -0.1587734 2.3281284 0.1757244 0.0308222 -0.100399 1.1858152 -0.2554437 0.1136675 -0.3578872 0.3661067 1.0382908 -0.0311906 -0.0541461 0.1359919 0.236878 0.0300924 -0.0772594 -0.0031113 0.3518597 0.7505578 -0.0891031 0.349251 -0.1017142 0.1708505 0.0514641 0.620454 0.0062562 0.7684938 -0.1313003 0.0206745 0.0435437 -0.0386359 0.0496501 -0.0351218 0.0521054 -0.0031892 -0.1393651 0.0807079 0.0571199 -0.034053 0.0645229 0.1044026 0.0366094 -0.0290766 0.037595 0.1693815 0.0434923 -0.0717154 0.0295053 -0.0723246 0.0747694 0.0392746 0.0180684 0.0390835 0.172399 -0.0640169 0.0308198 -0.0443864 0.0586684 0.0513165 0.1028032 -0.062361 0.0668692 -0.0561265 -0.0080461 0.0359302 0.0261896 -0.0890814 -0.0743413 -0.0895607 0.0456572 -0.0397146 0.0481143 -0.0042177 -0.0166977 0.0054786 -0.073437 0.0878385 0.0371245 0.0012652 0.0244099 -0.064455 0.0707008 -0.0322583 -0.0462672 0.0212685 -0.02151 -0.0408567 -0.0854303 -0.0256963 0.0046683 -0.1874374 -0.0585169 0.0235783 -0.0600249 0.099794 -0.0067331 0.0560367 -0.0159137 0.0934089 0.0844076 0.0687751 -0.0932004 0.0647608 0.0397761 0.0762565 -0.0691872 0.0416811 -0.005161 0.1275051 -0.0384335 -0.0015048 0.0039076 -0.1239568 -0.0733537 0.0130609 -0.0328837 0.054212 unknown
polarizability: 169.3365494|4.5013905|89.3799673|14.2553584|-12.1527089|82.5045033 unknown
InChI: InChI=1S/C8H9ClO3/c1-2-11-8(10)7-4-3-6(5-9)12-7/h3-4H,2,5H2,1H3
charge 0 multiplicity 1
21 atoms
Cl 4.0130 0.092061 1.883626
O  1.045608 -0.544288 0.034994
O  -2.399298 0.472332 -0.564025
O  -1.621026 -1.571265 0.298707
C  -0.083936 0.203218 -0.340293
C  2.169759 0.251058 -0.255124
C  0.317058 1.435899 -0.854157
C  1.751274 1.466838 -0.797891
C  -1.401193 -0.422349 -0.150228
C  -3.808031 -0.005153 -0.406412
C  3.488121 -0.314327 0.075363
C  -4.319987 0.266794 1.01094
H  -0.353265 2.208406 -1.221922
H  2.402279 2.281415 -1.108843
H  -4.35967 0.571477 -1.16593
H  -3.842497 -1.082626 -0.646233
H  4.288248 0.120229 -0.537156
H  3.497154 -1.41166 0.036436
H  -5.388717 -0.009526 1.078652
H  -3.762857 -0.331209 1.751147
H  -4.223225 1.33598 1.266944
