program: Gaussian 09
title: 000263165
version: EM64L-G09RevD.01
frameworkgroup: C1[X(C7H14O3)]
method: RPBEPBE
basis: SDD
operation: Freq
keyword: #pfreq=noraman
keyword: PBEPBE/SDD
title: #p freq=noraman PBEPBE/SDD
converged: YES YES NO NO
title: Mulliken charges:
elementType: O O O C C C C C C C H H H H H H H H H H H H H H
charge: -0.317570 -0.440613 -0.464200 0.324419 -0.438696 -0.429290 -0.376143 -0.324766 -0.366390 -0.412527 0.234343 0.240897 0.222774 0.198408 0.200944 0.210871 0.180399 0.218955 0.188731 0.235384 0.215092 0.197314 0.348766 0.352898
chargesum: 0.00000
title: Mulliken charges with hydrogens summed into heavy atoms:
elementType: O O O C C C C C C C
charge: -0.317570 -0.091847 -0.111301 0.324419 0.036544 -0.008108 0.035672 0.074587 0.057725 -0.000120
polarizability: 9.16132571e+01 -2.93853696e+00 8.08173541e+01 2.13029741e+00 5.21926027e-01 7.62660086e+01
1716.lowfreq: -18.5019 -0.0012 -0.0008 -0.0002 7.9238 23.8651 87.1891 110.1720 118.3255
frequency: 87.1394 110.1248 118.2817 165.8219 213.8287 238.3990 274.9392 288.2567 298.0150 361.6847 410.2407 447.8101 474.6513 507.5283 539.1566 593.6926 688.4921 798.5063 837.9872 847.7108 893.1403 907.1354 961.7197 967.1599 976.9730 991.7461 1013.9045 1029.7575 1071.2699 1094.9204 1131.3799 1147.9304 1170.3422 1184.0449 1204.0214 1236.2381 1258.4171 1275.2477 1278.0552 1325.9283 1341.4511 1344.8670 1357.0309 1358.9203 1385.0666 1396.0932 1449.0369 1460.6076 1463.2430 1468.0885 1474.7307 1482.8130 2944.1033 2952.8506 2960.2607 2971.4537 2984.9154 2997.4969 3004.7263 3038.7644 3048.8579 3064.2156 3067.8729 3107.1609 3504.9032 3583.6872
redmass: 4.3401 3.4546 3.3686 3.0949 1.7137 1.3783 3.3819 2.6985 2.1591 1.9718 3.1007 3.4851 2.7103 1.3661 2.6336 2.2581 3.5720 1.8297 2.0000 2.8222 1.5556 2.0982 2.3879 1.9409 3.8157 3.9660 1.6694 2.5134 2.2491 2.1084 1.5212 1.5875 1.2411 1.2440 1.5190 1.3508 1.4851 1.3695 1.3260 1.2575 1.3894 1.4360 1.4465 1.4560 1.2612 1.4427 1.0900 1.0817 1.0793 1.0877 1.0778 1.0858 1.0613 1.0619 1.0699 1.0647 1.0608 1.0610 1.1068 1.0960 1.1008 1.1017 1.0981 1.0940 1.0644 1.0669
irintensity: 3.1146 3.4057 4.0072 0.5017 64.4785 83.3289 15.5862 4.4623 2.9042 2.1388 4.5670 0.1227 26.6808 160.4405 6.3628 31.1318 18.6470 8.7734 6.7675 6.0347 1.5910 18.1835 4.1893 56.3974 48.0799 94.0585 8.0344 73.0440 5.8098 11.2127 14.1091 11.5154 13.4384 10.2960 19.2706 1.9770 7.8859 9.2292 3.9203 20.3297 9.0079 2.5320 7.0568 7.5941 16.8974 3.2770 7.4061 10.9057 0.9390 17.8500 4.3613 12.9122 5.6889 97.9941 75.5035 38.1126 31.6393 8.9415 70.9150 38.0717 60.1615 12.0626 52.6109 15.2239 11.2059 3.8683
temp: 298.150 k
press: 1.00000 atm
elementType: 8 8 8 6 6 6 6 6 6 6 1 1 1 1 1 1 1 1 1 1 1 1 1 1
symmnumber: 1
zpe: 542116.6 jmol-1
zpe.correction: 0.206481 hartree
zpe.thermalcorrener: 0.217160 hartree
zpe.thermalcorrenthalpy: 0.218104 hartree
zpe.thermalcorrgfe: 0.171004 hartree
zpe.sumelectzpe: -499.953032 hartree
zpe.sumelectthermal: -499.942353 hartree
zpe.sumelectthermalent: -499.941409 hartree
zpe.sumelectthermalfe: -499.988509 hartree
dipole: -1.8616 -3.4510 -1.9403
dipole: 4.3749
quadrupole: -57.8679 -62.2781 -61.9395
quadrupole: -6.7268 -3.6279 0.9246
quadrupole: 2.8272 -1.5829 -1.2444 -6.7268 -3.6279 0.9246
hfenergy: -500.159513 hartree
pointgroup: C01 [X(C7H14O3)]
dipole: -0.8532817 1.4742076 -0.2474424 debye
dipolederiv: -0.933967 0.0733951 0.1537345 0.0863362 -0.5063229 -0.0909614 0.1892483 -0.0486255 -0.5531283 -0.5333969 -0.025724 -0.168281 -0.0459029 -0.6471536 0.239191 -0.168881 0.2921118 -0.4944664 -0.6797588 -0.0169123 0.1280779 -0.0069676 -0.1454262 0.0796628 0.1641944 0.1000409 -0.7108515 0.3651149 0.0813719 -0.1432237 0.0473585 0.2615833 0.0993908 -0.2598085 0.0513713 0.4234086 -0.0563398 -0.0155599 -0.0475533 -0.0033785 -0.0120141 -0.0071209 0.0401464 -0.0409663 -0.0544446 0.0353957 0.0139849 0.0078737 -0.0192825 0.1462715 -0.0552064 -0.0114215 -0.0211941 0.0616175 -0.0106763 -0.0337551 -0.0089298 -0.0259487 0.0774815 -0.0807972 -0.051685 -0.0547086 -0.0270095 0.7194567 -0.0983717 -0.1177152 -0.073725 0.3923798 0.0733395 0.0476628 -0.0021966 0.2348845 0.3001825 0.0617941 0.068154 0.1136614 0.4450484 -0.1176705 0.0182161 -0.132313 0.3280026 0.4566955 0.059089 -0.1564455 -0.0010763 0.1015498 -0.0379199 -0.1352349 -0.068856 0.4845349 0.0517372 -0.031781 0.0060414 -0.026807 -0.1073757 0.0109911 0.0022585 0.0562397 0.0951129 0.0215047 0.026393 0.0740783 0.0309663 0.114226 0.0101569 0.0865865 -0.0013548 -0.0769713 -0.0388137 -0.065517 -0.0987674 -0.0883378 0.0077682 -0.1086173 -0.0921801 -0.0873014 -0.0607007 0.0492418 0.0069205 0.0287197 0.0415312 -0.1652307 0.1176292 0.0287889 0.0652691 0.0228461 -0.1998475 0.0761779 0.0293281 0.1000508 0.0531915 -0.0143147 -0.0089067 -0.0054998 0.0677494 0.0941681 0.0071486 -0.0088819 -0.0583967 -0.1440394 0.0676932 0.0099254 0.05631 0.0040611 -0.0471553 0.0058051 0.0005739 0.0489381 -0.2167689 0.0148002 -0.0541699 0.1062369 0.0580338 -0.0132872 0.0169029 0.0682434 -0.0039699 0.0772284 0.0181179 0.0857779 -0.0298742 -0.1579488 -0.0581061 -0.0880895 -0.0725537 -0.1321337 -0.1070052 -0.0497928 -0.1375299 -0.0605867 -0.0339236 0.044318 -0.0065712 0.0684769 0.0445154 0.0615665 -0.0456491 0.0990598 -0.0170177 -0.0373124 -0.0489071 -0.0999833 -0.0592071 -0.05109 0.0173963 -0.0799497 -0.0492269 -0.0956913 -0.1238103 -0.1366408 0.1348699 0.0251704 0.143739 -0.0213478 0.0203285 -0.0154106 0.0541818 -0.0107189 0.2892201 -0.0343593 0.166129 -0.0271898 0.2934276 -0.1146989 0.1602118 -0.1119629 0.2560606 0.3298615 -0.0472287 0.0569576 -0.0928904 0.0235656 0.0513977 0.0523782 -0.0036125 0.3049743 unknown
polarizability: 89.8989806|0.7164879|79.2172997|-5.6262417|-2.574412|79.5803395 unknown
InChI: InChI=1S/C7H14O3/c8-5-7(6-9)3-1-2-4-10-7/h8-9H,1-6H2
charge 0 multiplicity 1
24 atoms
O  -0.206171 0.147193 1.237281
O  1.407253 -2.027985 0.958398
O  1.721246 1.312763 -1.739758
C  0.504324 0.037439 -0.077591
C  -0.350714 -0.712527 -1.1244
C  -1.809456 -0.204003 -1.200222
C  -2.454525 -0.213947 0.203752
C  -1.604159 0.621112 1.174056
C  1.769032 -0.772613 0.301203
C  0.898351 1.460523 -0.526804
H  -0.346838 -1.785201 -0.852163
H  0.149643 -0.611829 -2.1050
H  -2.386901 -0.841472 -1.895059
H  -1.842278 0.824394 -1.615386
H  -3.48268 0.19684 0.17409
H  -2.521017 -1.254743 0.576148
H  -1.627732 1.69227 0.877898
H  -1.964187 0.541394 2.213915
H  2.409128 -0.150594 0.962853
H  2.334501 -1.039952 -0.603955
H  1.468527 1.943574 0.293961
H  -0.004566 2.069229 -0.742237
H  0.746809 -1.779647 1.659648
H  2.058909 2.19888 -2.020531
