program: Gaussian 09
title: 000263164
version: EM64L-G09RevD.01
frameworkgroup: C1[X(C7H13NO2)]
method: RPBEPBE
basis: SDD
operation: Freq
keyword: #p
keyword: freq=noraman
keyword: PBEPBE/SDD
title: #p freq=noraman PBEPBE/SDD
converged: YES YES NO NO
title: Mulliken charges:
elementType: O O N C C C C C C C H H H H H H H H H H H H H
charge: -0.301847 -0.286716 -0.353772 -0.027748 -0.470708 -0.463222 -0.287095 -0.387382 0.246046 -0.769228 0.243984 0.227219 0.233133 0.226733 0.234478 0.222527 0.200192 0.219717 0.257542 0.324128 0.249652 0.212210 0.250155
chargesum: 0.00000
title: Mulliken charges with hydrogens summed into heavy atoms:
elementType: O O N C C C C C C C
charge: -0.301847 -0.286716 -0.029644 0.216236 -0.010356 -0.002011 0.135624 0.089877 0.246046 -0.057211
polarizability: 1.12553913e+02 -2.31060436e+00 8.40077364e+01 3.49938848e+00 -1.22861300e+00 6.60417244e+01
1716.lowfreq: -6.8266 -0.0006 -0.0004 0.0004 3.7034 15.1020 34.2222 63.7672 72.1656
frequency: 34.2135 63.7624 72.1587 81.2066 101.5568 201.1360 232.5335 273.4687 316.8571 430.1339 472.1455 579.9796 585.4740 608.8227 671.5525 678.3937 761.9548 838.5943 852.9843 883.0767 913.9777 946.4256 969.0628 992.9067 1004.4469 1039.5192 1042.4566 1064.0435 1118.7344 1128.3461 1148.8187 1168.8548 1210.1756 1230.2797 1256.9415 1265.0942 1300.0838 1310.8946 1315.1316 1338.9111 1368.3335 1386.2429 1451.3085 1461.1439 1465.5102 1470.3007 1473.3503 1487.0484 1491.6542 1614.1149 2967.2849 2972.8645 2995.4411 3011.0773 3015.6444 3028.4171 3063.1509 3067.4079 3074.5421 3092.6271 3097.3047 3099.2806 3541.5341
redmass: 3.6257 3.8627 1.6936 2.1510 2.3262 2.2718 5.6879 2.2342 2.5849 2.5907 3.0891 2.0619 3.0448 3.7044 2.6151 1.3772 3.5538 1.7918 1.9180 3.2076 2.7839 2.0025 1.9193 1.7146 2.2308 2.4867 1.7819 1.8374 3.5574 1.7204 1.2938 1.5926 1.2016 1.3523 1.7534 1.3591 1.3836 1.2892 1.2553 1.3027 1.4682 1.2376 1.0459 1.1077 1.1032 1.0842 1.0923 1.7789 1.1782 6.7161 1.0661 1.0662 1.0358 1.0638 1.0644 1.0817 1.0961 1.0984 1.1031 1.1059 1.0985 1.1004 1.0776
irintensity: 1.1297 6.1865 0.2087 12.1503 6.0561 4.1402 3.5466 0.4532 0.3952 10.5823 10.6623 5.7195 20.7538 0.3929 26.5071 70.8303 9.9701 6.6010 15.6063 5.7635 8.2988 22.2952 0.4818 5.1530 18.9943 80.9567 31.3616 0.5968 1.1251 7.1593 4.6139 1.9268 14.5420 15.8634 81.0297 1.0768 4.9534 6.7574 4.6775 4.2328 3.3608 59.1597 14.7686 55.4210 49.9978 12.3357 19.3804 178.2160 49.1227 218.9562 41.9693 88.1665 12.5087 11.6357 37.8293 37.7914 17.5388 26.2422 10.7594 66.6457 13.7079 21.0446 44.4836
temp: 298.150 k
press: 1.00000 atm
elementType: 8 8 7 6 6 6 6 6 6 6 1 1 1 1 1 1 1 1 1 1 1 1 1
symmnumber: 1
zpe: 515594.6 jmol-1
zpe.correction: 0.196380 hartree
zpe.thermalcorrener: 0.207197 hartree
zpe.thermalcorrenthalpy: 0.208141 hartree
zpe.thermalcorrgfe: 0.158354 hartree
zpe.sumelectzpe: -478.943609 hartree
zpe.sumelectthermal: -478.932792 hartree
zpe.sumelectthermalent: -478.931848 hartree
zpe.sumelectthermalfe: -478.981635 hartree
dipole: -4.1295 1.8006 -0.4217
dipole: 4.5247
quadrupole: -60.4531 -63.5512 -59.7707
quadrupole: 11.6336 0.7871 -1.6663
quadrupole: 0.8053 -2.2929 1.4876 11.6336 0.7871 -1.6663
hfenergy: -479.139989 hartree
pointgroup: C01 [X(C7H13N1O2)]
dipole: -1.6248671 -0.7267711 -0.0241285 debye
dipolederiv: -0.8904532 -0.1694181 -0.0117438 -0.2907009 -0.6282183 -0.037011 0.0465839 -0.0327834 -0.394339 -0.8422881 -0.0704682 -0.0116032 -0.4248684 -0.9411697 -0.0566477 -0.0394145 -0.0532435 -0.3927572 -1.3898093 -0.119373 -0.0378993 -0.0690643 -0.3832153 -0.0025958 -0.0964962 0.0190059 -0.4657542 0.4406457 0.1444162 0.0087563 0.3776765 0.4739995 -0.0187268 0.0833412 0.0157243 0.3267869 -0.0986675 0.0234868 0.0672861 -0.0161921 -0.0210056 0.0202717 0.0679232 -0.0135821 0.0878592 -0.0109798 -0.022928 0.0779044 0.0622373 -0.0836275 -0.0263847 0.0406895 -0.0134576 0.0812481 0.7288605 0.2323251 0.0403572 0.0505588 0.2742967 -0.016045 -0.0417822 -0.0146881 0.3217707 0.3054907 -0.1123951 -0.0901141 -0.3679379 0.1185011 -0.0043621 -0.1056579 -0.0120785 0.2333269 1.7838545 0.1689581 -0.0041498 0.454497 1.0937853 0.0981451 -0.0185186 0.0785068 0.1867966 -0.2548706 0.2342518 0.0260409 0.2202005 -0.1624843 -0.0239454 0.0363681 -0.0195945 0.0237689 -0.0185627 -0.0464441 0.0740015 -0.0498801 0.0065725 0.0136033 0.0674608 0.0501973 -0.129208 -0.0317599 0.0323612 -0.07843 0.0050429 0.0666206 0.02601 -0.0886308 0.0742478 -0.1077402 0.0958694 -0.0545128 -0.0181067 -0.036062 -0.1053395 -0.0625899 -0.0046476 -0.0959931 0.0467072 0.090435 -0.0177084 -0.0811721 -0.0021387 0.0336256 -0.0110606 -0.0379531 -0.0091614 -0.146577 -0.1825965 0.0428401 0.0154447 0.0384363 0.0939388 -0.0003715 -0.0114109 -0.0009954 0.0892059 0.017522 -0.0250609 0.0084294 -0.06514 -0.0898207 0.0979161 0.0523368 0.1381716 -0.0051057 -0.1436732 -0.0798742 -0.0954031 -0.0144114 0.0422767 -0.0276285 -0.1409328 -0.085429 -0.1224063 -0.0895317 0.0378994 0.0965931 0.0794327 0.0704612 0.0257204 0.1215719 -0.0199005 -0.1168957 0.1095228 -0.0786629 0.0086814 0.0329375 -0.0224291 0.0200869 -0.0029212 0.0227641 0.0912296 0.2788454 -0.0042121 0.0218044 0.0551719 0.1242006 -0.0143799 0.0742202 -0.0256325 0.316085 0.0355099 0.0140059 -0.0926715 0.0135838 0.0837284 -0.0233323 -0.126036 0.0150276 -0.0176561 0.020936 -0.1205835 -0.0102667 -0.0425337 -0.1217621 -0.0263985 0.0001765 -0.0244324 0.1100347 0.0457005 -0.0089032 0.0862607 -0.0108457 0.0770649 0.0497261 0.1237297 0.0073266 -0.0163801 unknown
polarizability: 112.7613709|2.6904962|84.096706|0.2484935|0.6902435|65.7452973 unknown
InChI: InChI=1S/C7H13NO2/c1-6(9)8-5-7-3-2-4-10-7/h7-8H,2-5H2,1H3
charge 0 multiplicity 1
23 atoms
O  -1.254632 -1.067514 -0.497912
O  2.974493 1.29186 0.42291
N  1.263557 -0.284038 0.341994
C  -0.906761 0.38851 -0.611451
C  -2.229329 1.161672 -0.384959
C  -3.098065 0.170818 0.437178
C  -2.695237 -1.190037 -0.162904
C  0.173388 0.690772 0.442857
C  2.598107 0.081771 0.322465
C  3.591602 -1.068595 0.171386
H  -0.490257 0.538067 -1.624498
H  -2.715038 1.382817 -1.352179
H  -2.064382 2.11753 0.142034
H  -2.831683 0.216882 1.508509
H  -4.178353 0.372386 0.339789
H  -2.799599 -2.037334 0.535858
H  -3.267943 -1.406586 -1.087791
H  -0.281812 0.662783 1.454403
H  0.613946 1.692523 0.291029
H  0.980048 -1.260359 0.230645
H  4.259106 -1.086543 1.050319
H  3.10956 -2.056031 0.066985
H  4.223483 -0.882051 -0.713968
