program: Gaussian 09
title: 000263162
version: EM64L-G09RevD.01
frameworkgroup: C1[X(C7H12O3)]
method: RPBEPBE
basis: SDD
operation: Freq
keyword: #pfreq=noraman
keyword: PBEPBE/SDD
title: #p freq=noraman PBEPBE/SDD
converged: YES YES NO NO
title: Mulliken charges:
elementType: O O O C C C C C C C H H H H H H H H H H H H
charge: -0.261523 -0.284267 -0.247677 -0.018966 -0.466181 -0.042319 -0.453601 -0.297040 -0.290792 -0.328636 0.222992 0.244426 0.230276 0.240848 0.225559 0.226725 0.192122 0.223476 0.214589 0.226062 0.209305 0.234622
chargesum: 0.00000
title: Mulliken charges with hydrogens summed into heavy atoms:
elementType: O O O C C C C C C C
charge: -0.261523 -0.284267 -0.247677 0.204026 0.008521 0.198529 -0.001316 0.118558 0.149860 0.115291
polarizability: 1.02744621e+02 -1.40646798e+00 7.30089909e+01 -4.58528231e+00 7.04783393e-01 6.72938039e+01
1716.lowfreq: -24.6608 -12.5170 0.0004 0.0009 0.0011 8.8945 39.3837 58.5341 68.6059
frequency: 39.1758 58.4839 68.5550 138.0713 233.3853 245.7574 316.4972 368.6110 412.4041 570.2342 613.2708 655.8123 686.8918 812.8540 844.5892 854.0476 865.4088 875.1324 902.0666 905.2375 926.1330 939.5412 975.9953 1012.9581 1026.7755 1046.6426 1096.7699 1108.4829 1134.0438 1145.8711 1156.1410 1166.2052 1194.3985 1213.9881 1230.3203 1259.9542 1279.4468 1308.1012 1313.1463 1315.3874 1322.7078 1333.0771 1373.9935 1461.1956 1469.8313 1470.2319 1475.0868 1488.7221 2960.5441 2985.5563 2996.0537 2998.2456 3011.0908 3012.6174 3028.1957 3069.8480 3082.7103 3090.4101 3101.6137 3106.7679
redmass: 2.8470 4.0931 3.6127 3.4211 1.8140 2.4508 6.5339 2.9643 5.7705 1.9141 2.4037 4.2506 7.3064 3.3007 2.9194 2.4144 2.6073 2.7665 2.9205 1.8610 2.3230 2.5225 3.0746 3.1392 3.5088 3.0330 1.9252 1.7481 2.4254 1.3957 1.1420 1.4450 1.2596 1.3605 1.2063 1.2741 1.1976 1.3960 1.2491 1.2619 1.2379 1.2867 1.4201 1.0917 1.0889 1.0938 1.0974 1.0930 1.0680 1.0689 1.0844 1.0618 1.0655 1.0622 1.0885 1.0969 1.1030 1.1014 1.1015 1.1016
irintensity: 6.9588 2.1205 5.1152 2.2036 3.2813 3.9630 0.6018 19.3137 6.9153 3.8721 4.5021 5.8532 3.5941 55.1826 8.5968 10.2834 13.9444 4.0298 16.1380 16.9339 9.3671 21.2975 12.9823 111.1051 84.2352 53.6088 15.9270 13.6886 19.8239 0.8312 1.1553 5.6686 12.8211 5.4976 4.2041 6.0566 0.4933 6.3327 4.6594 4.3450 0.0929 1.5712 6.5069 9.2529 5.2874 11.8152 1.3580 1.7084 82.4744 36.6717 33.6716 75.7392 17.3332 27.2289 63.7580 36.5358 34.0652 24.9921 37.1685 36.7110
temp: 298.150 k
press: 1.00000 atm
elementType: 8 8 8 6 6 6 6 6 6 6 1 1 1 1 1 1 1 1 1 1 1 1
symmnumber: 1
zpe: 485416.4 jmol-1
zpe.correction: 0.184885 hartree
zpe.thermalcorrener: 0.194434 hartree
zpe.thermalcorrenthalpy: 0.195378 hartree
zpe.thermalcorrgfe: 0.148716 hartree
zpe.sumelectzpe: -498.761998 hartree
zpe.sumelectthermal: -498.752449 hartree
zpe.sumelectthermalent: -498.751505 hartree
zpe.sumelectthermalfe: -498.798167 hartree
dipole: -0.3895 2.1943 0.8943
dipole: 2.4013
quadrupole: -45.4215 -68.5867 -57.4675
quadrupole: 1.4694 -3.7106 0.6367
quadrupole: 11.7371 -11.4282 -0.3089 1.4694 -3.7106 0.6367
hfenergy: -498.9468836 hartree
pointgroup: C01 [X(C7H12O3)]
dipole: 0.1397581 -0.8345754 0.4201232 debye
dipolederiv: -0.928717 0.058876 -0.1067079 0.1379707 -0.4599029 0.0514327 -0.0781114 0.0623988 -0.3958175 -1.0100074 0.159125 -0.0215327 0.1551917 -0.5742187 -0.0196882 -0.0629294 -0.0474576 -0.3807514 -0.9175531 -0.0763763 -0.1115375 -0.1155224 -0.5379363 -0.0423728 -0.1205762 -0.0654027 -0.436356 0.4267554 -0.1112846 0.0810728 -0.3140561 0.264452 -0.0973433 0.2093146 -0.0272621 0.2463584 -0.0870755 -0.0573594 0.0106238 0.0332293 -0.0536963 0.0012603 0.0118129 0.0657378 0.1229932 1.1280913 0.0099589 0.0327866 -0.0408161 0.6186636 0.069549 -0.0004968 0.0187291 0.4898209 -0.0232114 0.0547015 0.0100115 -0.0573863 -0.0604371 0.0880722 -0.0254905 0.0772046 0.1122602 0.6553153 -0.0475373 0.1270397 0.1658536 0.2408466 0.0810454 0.1295404 -0.0147081 0.3776724 0.6644566 -0.087138 -0.0333245 0.1386773 0.132845 -0.026608 0.0074611 -0.0513116 0.3084042 0.4443704 0.0230684 0.0934313 -0.1513588 0.1678117 -0.0771261 0.1268945 0.0196317 0.4042809 -0.0420805 0.0060761 -0.0792114 0.0224186 0.0247469 -0.0161252 -0.1129507 -0.0056254 -0.1343753 0.0693126 0.0589339 -0.0383313 0.0388647 -0.0300523 0.0850568 -0.0322956 0.1081031 -0.0011518 0.0603495 0.005967 0.0296191 0.0222103 0.0442035 -0.0479235 0.0300424 -0.1055919 -0.1063113 -0.0549138 -0.0019114 -0.0694146 0.0199698 0.0337521 0.0012608 -0.0890655 0.0127904 -0.1208557 -0.0884859 -0.1155344 -0.0385047 -0.1275871 0.0053253 -0.042429 -0.0755183 -0.0561727 0.0605594 0.0520292 0.0228292 0.0242913 0.0315311 0.0507436 -0.0330754 0.0863391 -0.0063243 -0.1534165 -0.029818 -0.008576 -0.0273298 -0.0688889 0.0428536 -0.057736 -0.1093541 0.0018324 -0.2249116 -0.1065064 0.1100627 0.0119787 0.1232337 -0.0447231 -0.0267012 0.0434632 -0.0621319 0.0637564 -0.1350087 0.0204593 0.0854406 -0.0394553 0.0556766 -0.0054905 0.153458 -0.0402169 -0.1024685 -0.0074123 0.0507994 -0.0362578 0.0882725 0.0017511 0.0897318 -0.0897686 0.1100634 -0.0074806 0.0169682 0.0269639 0.0672598 0.0482882 0.0404477 0.0258573 -0.0214641 -0.0207754 -0.2059066 -0.0868586 -0.1021041 -0.0114031 -0.1106404 0.0368474 -0.0006471 0.019695 0.0264893 0.0836967 unknown
polarizability: 102.8730487|-1.9098314|72.9332628|3.758154|-1.2633015|67.2411041 unknown
InChI: InChI=1S/C7H12O3/c1-2-6(8-3-1)7-9-4-5-10-7/h6-7H,1-5H2
charge 0 multiplicity 1
22 atoms
O  -1.420411 1.253185 -0.018684
O  1.383393 -1.211334 -0.361129
O  1.588063 1.152698 -0.410868
C  -0.560941 0.090627 0.33775
C  -1.459123 -1.170501 0.234425
C  0.639298 0.052705 -0.618944
C  -2.890916 -0.600899 0.397881
C  -2.779831 0.748478 -0.336733
C  2.790663 -0.839139 -0.077807
C  2.669031 0.605035 0.439728
H  -0.19615 0.254453 1.370588
H  -1.197188 -1.924541 0.992422
H  -1.343689 -1.640572 -0.76009
H  0.313933 0.111998 -1.674412
H  -3.664231 -1.259486 -0.034033
H  -3.123175 -0.437031 1.465732
H  -2.886523 0.617426 -1.434118
H  -3.496304 1.512535 0.008488
H  3.389547 -0.887549 -1.007314
H  3.176277 -1.555612 0.665483
H  2.383072 0.632839 1.510061
H  3.560306 1.227186 0.267774
