program: Gaussian 09
title: 000263151
version: EM64L-G09RevD.01
frameworkgroup: C1[X(C21H18O)]
method: RPBEPBE
basis: SDD
operation: Freq
keyword: #pfreq=noraman
keyword: PBEPBE/SDD
title: #p freq=noraman PBEPBE/SDD
converged: YES YES NO NO
title: Mulliken charges:
elementType: O C C C C C C C C C C C C C C C C C C C C C H H H H H H H H H H H H H H H H H H
charge: -0.287110 0.096545 -0.657115 0.351122 0.361482 0.361235 0.231061 -0.455733 -0.413284 -0.386290 -0.356558 -0.413549 -0.404327 -0.372545 -0.242046 -0.244393 -0.239337 -0.242552 -0.224160 -0.244477 -0.245990 -0.241773 0.262280 0.231116 0.226317 0.234066 0.236535 0.248626 0.262958 0.281692 0.248333 0.230423 0.226954 0.226964 0.223716 0.226790 0.223404 0.225610 0.225897 0.228113
chargesum: 0.00000
title: Mulliken charges with hydrogens summed into heavy atoms:
elementType: O C C C C C C C C C C C C C C C C C C C C C
charge: -0.287110 0.096545 -0.163719 0.351122 0.361482 0.361235 0.231061 0.004649 -0.176748 -0.137664 -0.093601 -0.131857 -0.155994 -0.142122 -0.015092 -0.017429 -0.015621 -0.015761 -0.000756 -0.018867 -0.020092 -0.013660
polarizability: 2.60884790e+02 -1.02827187e+01 1.98298376e+02 6.60948234e+00 -5.10275113e+00 1.87938675e+02
1716.lowfreq: -4.6169 -0.0008 -0.0006 -0.0005 2.3014 9.7727 21.2894 34.3957 48.9718
frequency: 21.1070 34.1922 48.8388 60.5147 84.4711 91.6064 164.9408 197.6411 225.4103 239.4137 257.2888 265.9139 298.7730 315.4076 334.5760 400.6217 402.9244 424.8707 432.1057 455.8959 486.3808 504.2193 536.8051 577.6440 592.5667 609.6544 616.1369 617.0029 668.0649 703.3220 703.9057 706.9002 716.3079 738.4898 750.6818 766.1349 779.7947 823.3340 851.0043 854.8879 860.2772 870.1913 911.1553 930.8384 935.5794 949.4823 977.4944 983.3747 985.0937 987.4591 990.3155 991.4473 996.5539 998.1151 1006.9745 1013.7082 1022.9266 1031.5771 1040.1312 1055.6453 1082.4261 1095.9209 1110.6197 1169.1682 1171.0473 1172.9670 1174.0411 1186.2627 1194.5596 1197.4467 1205.4167 1211.5933 1239.1839 1249.0105 1279.8895 1314.9722 1316.3528 1326.7945 1339.7200 1378.3668 1380.7835 1387.7280 1432.9186 1434.6210 1440.4068 1451.2521 1454.8158 1479.7000 1482.9351 1488.6856 1589.4664 1591.5025 1595.1842 1609.8989 1612.9907 1615.3946 2942.4749 2989.2631 3038.6148 3048.4284 3110.2721 3114.1717 3119.4988 3122.9913 3127.7513 3131.1901 3136.7241 3140.7229 3144.3200 3153.3184 3157.5727 3159.2428 3165.4925 3175.8598
redmass: 3.8242 4.4759 4.2302 4.8596 4.5293 4.0270 3.7178 4.5700 4.2128 4.9125 3.4659 3.4721 4.6244 3.3867 3.4589 2.8107 2.8613 2.9138 3.6303 5.0977 3.3323 3.9338 3.9875 4.8478 4.9156 4.9794 6.4219 6.1982 5.7607 3.0950 1.8727 1.9211 3.1879 3.1565 1.3216 2.0008 2.0886 3.0268 1.7465 1.9645 1.2544 1.4494 1.8474 1.4712 1.4930 2.3866 1.4011 1.4057 1.3920 2.3121 5.3201 4.8102 1.3424 1.3300 5.0840 2.7139 2.9480 2.0477 2.3353 2.6635 1.5840 1.7945 1.9240 1.4515 1.0601 1.0562 1.1427 1.1430 1.2392 2.1968 1.8504 2.0320 1.3990 1.7989 1.6876 1.5974 1.3519 1.4705 1.3887 8.0825 8.7918 5.1057 2.2240 2.1689 2.3346 1.1430 1.1039 2.2544 2.1974 2.3666 6.1341 6.1699 6.7969 6.0301 6.0238 6.4870 1.0674 1.0609 1.0996 1.0934 1.0868 1.0894 1.0847 1.0845 1.0883 1.0878 1.0924 1.0939 1.0927 1.0955 1.0988 1.1003 1.1009 1.0954
irintensity: 0.0434 0.0565 0.0397 0.2912 0.4379 0.2427 0.3778 0.5139 0.3692 0.1988 5.2909 6.5817 1.1946 5.5940 3.5917 0.0385 0.1874 4.4818 6.1664 1.6943 0.2715 1.0875 3.3144 6.0726 11.4615 21.5080 0.2850 2.5785 11.0465 24.3590 43.8796 39.8447 21.2572 22.2545 55.7835 44.1794 31.8354 2.2051 1.4291 1.8164 0.1128 1.2224 3.9050 4.1645 0.8056 0.4898 0.1429 0.8820 1.8988 12.9740 3.7365 0.8548 2.1016 1.2834 70.1837 30.9627 3.4483 6.1966 3.7701 16.0643 2.6781 5.1563 5.8426 5.0472 0.6108 0.1273 0.8524 8.8888 3.0609 3.0389 8.4827 8.1043 1.7006 13.1924 7.9074 2.0553 4.2198 1.9623 8.0279 1.0469 0.5416 3.4050 13.2944 9.0361 6.8669 14.6971 7.9878 26.9093 10.1727 20.5053 1.4743 0.2396 7.3097 6.0639 3.2920 1.8892 40.9987 16.9440 13.4630 19.8621 14.7040 1.3991 2.3244 0.7036 4.6419 3.7030 25.3082 33.3026 20.6513 34.7692 37.3842 33.9302 17.3545 8.0940
temp: 298.150 k
press: 1.00000 atm
elementType: 8 6 6 6 6 6 6 6 6 6 6 6 6 6 6 6 6 6 6 6 6 6 1 1 1 1 1 1 1 1 1 1 1 1 1 1 1 1 1 1
symmnumber: 1
zpe: 851382.5 jmol-1
zpe.correction: 0.324274 hartree
zpe.thermalcorrener: 0.341631 hartree
zpe.thermalcorrenthalpy: 0.342575 hartree
zpe.thermalcorrgfe: 0.277844 hartree
zpe.sumelectzpe: -884.731805 hartree
zpe.sumelectthermal: -884.714448 hartree
zpe.sumelectthermalent: -884.713504 hartree
zpe.sumelectthermalfe: -884.778235 hartree
dipole: -0.9268 0.8403 -0.7055
dipole: 1.4362
quadrupole: -119.3125 -124.3864 -119.9679
quadrupole: -1.1136 -0.6860 0.0442
quadrupole: 1.9098 -3.1642 1.2543 -1.1136 -0.6860 0.0442
hfenergy: -885.0560791 hartree
pointgroup: C01 [X(C21H18O1)]
dipole: 0.3585756 -0.3284344 -0.2878247 debye
polarizability: 260.385587|-11.9562471|198.4741601|-5.9470069|5.6160853|188.2620942 unknown
InChI: InChI=1S/C21H18O/c1-3-11-19(12-4-1)21(20-13-5-2-6-14-20)15-17-9-7-8-10-18(17)16-22-21/h1-14H,15-16H2
charge 0 multiplicity 1
40 atoms
O  -0.058644 0.654426 1.558796
C  -0.455112 0.30917 0.155236
C  0.453758 1.155056 -0.779284
C  1.935208 1.031076 -0.448697
C  -1.907975 0.793073 0.007179
C  -0.350607 -1.215353 -0.040429
C  2.344524 0.627378 0.848468
C  1.308836 0.233728 1.891669
C  2.921566 1.355779 -1.413434
C  -2.709236 0.314061 -1.05949
C  -1.042267 -2.050603 0.877043
C  -2.437598 1.775185 0.879707
C  0.391379 -1.820817 -1.082281
C  3.723631 0.559267 1.160403
C  4.295617 1.288045 -1.099763
C  4.69989 0.888737 0.196293
C  -4.017637 0.809217 -1.252761
C  -0.99481 -3.454135 0.754939
C  -3.750502 2.263529 0.691038
C  0.437549 -3.229408 -1.21069
C  -4.544567 1.786883 -0.376967
C  -0.254532 -4.051026 -0.294498
H  0.140455 2.20886 -0.648915
H  0.263463 0.90684 -1.840306
H  1.332145 -0.867085 2.045756
H  1.516594 0.72006 2.861041
H  2.605588 1.667842 -2.41707
H  -2.315523 -0.458845 -1.729961
H  -1.615305 -1.583691 1.686213
H  -1.8198 2.135449 1.706602
H  0.948938 -1.205028 -1.794807
H  4.035586 0.246552 2.165319
H  5.045511 1.544385 -1.856413
H  5.764289 0.836453 0.450874
H  -4.626619 0.427828 -2.080343
H  -1.535694 -4.082857 1.471272
H  -4.152621 3.017103 1.378091
H  1.01741 -3.681235 -2.023502
H  -5.561732 2.167848 -0.5231
H  -0.218256 -5.141744 -0.394231
