program: Gaussian 09
title: 000263148
version: EM64L-G09RevD.01
frameworkgroup: C1[X(C16H27N)]
method: RPBEPBE
basis: SDD
operation: Freq
keyword: #pfreq=noraman
keyword: PBEPBE/SDD
title: #p freq=noraman PBEPBE/SDD
converged: NO YES NO NO
title: Mulliken charges:
elementType: N C C C C C C C C C C C C C C C C H H H H H H H H H H H H H H H H H H H H H H H H H H H
charge: -0.140453 0.302975 -0.076949 -0.554601 0.424029 -0.344978 -0.736898 -0.764272 -0.383000 -0.644623 -0.662311 -0.402178 -0.393402 -0.698503 -0.269009 -0.278811 -0.248225 0.181500 0.250156 0.184451 0.188838 0.216845 0.243200 0.204708 0.221438 0.252980 0.211187 0.204179 0.202283 0.190207 0.220959 0.210425 0.232321 0.227387 0.215378 0.226618 0.237616 0.236349 0.210103 0.214804 0.212598 0.222722 0.224404 0.227554
chargesum: 0.00000
title: Mulliken charges with hydrogens summed into heavy atoms:
elementType: N C C C C C C C C C C C C C C C C
charge: -0.140453 0.302975 0.104550 -0.119994 0.424029 0.060705 -0.067552 -0.095926 0.009489 0.019082 0.007072 -0.164562 -0.157053 -0.060997 -0.046286 -0.054407 -0.020672
polarizability: 1.83496390e+02 1.06382245e+01 1.93840435e+02 -1.16404799e+01 2.57311126e+00 1.55742220e+02
1716.lowfreq: -13.3004 -9.0779 0.0002 0.0005 0.0008 13.5623 20.4917 35.6796 60.3207
frequency: 18.6806 35.5866 60.2704 79.8268 85.9083 95.8626 113.3138 145.9558 164.0388 181.7597 188.8110 203.2832 225.3382 227.4670 243.8920 249.4019 272.4742 288.1481 311.1160 337.6091 352.1991 373.0238 384.9806 411.7209 426.6225 450.0058 493.6941 503.4429 559.3122 603.8070 618.3974 689.9656 710.1366 737.2929 755.1025 781.5754 820.7498 850.0376 859.7587 898.3834 904.5338 921.8273 928.0634 951.3914 969.0186 969.3494 981.5675 991.0791 995.1802 1013.5494 1029.7573 1031.8197 1048.3072 1074.2967 1080.8488 1086.8707 1108.6731 1114.9827 1132.9994 1135.7635 1144.1831 1173.1759 1188.0985 1193.5485 1205.2996 1224.0180 1228.8517 1235.8125 1272.3255 1290.7410 1300.3069 1318.9096 1329.6225 1333.4231 1347.2499 1362.3205 1371.1158 1373.6099 1388.9634 1395.8706 1420.0704 1432.6889 1448.6545 1461.4311 1466.1139 1469.7919 1472.6068 1475.2937 1475.9788 1477.8785 1481.8287 1483.9871 1484.8454 1489.2639 1496.3353 1500.8723 1510.3754 1582.1890 1607.4183 2885.9609 2897.5956 2956.2167 2971.0144 2973.0574 2981.0227 2986.8569 2996.1331 3000.2470 3008.0328 3028.3307 3033.4247 3036.7554 3058.1510 3062.8330 3069.0679 3070.4177 3073.2169 3084.0145 3085.7238 3094.9693 3104.0724 3118.0770 3125.4919 3142.6650 3148.9638 3162.4039
redmass: 2.3453 3.2644 3.3373 3.2923 1.6315 3.2549 2.0285 2.7521 2.1850 1.2460 1.6061 1.4653 1.0734 1.1670 2.6261 1.9484 3.0728 2.8037 2.9128 2.4140 3.1155 2.9535 2.8816 2.8578 2.6540 2.6232 2.8336 2.7731 2.8980 3.2760 6.3737 3.7368 1.6650 1.1185 2.1828 1.5365 3.0108 1.8135 1.2968 1.8392 1.9096 1.2406 1.4622 1.5540 2.3021 1.6245 1.3747 5.6476 1.3168 2.0371 2.2506 1.9447 2.4235 2.3235 1.2991 1.6359 1.9658 2.0188 2.0990 1.7721 2.1692 1.0627 2.2744 2.4429 1.2126 2.3662 2.3183 1.5970 1.3147 1.2333 1.0889 1.3900 1.2952 1.3923 1.4269 1.4051 1.2188 4.7798 1.2196 1.2039 1.1454 2.2074 1.1519 1.0712 1.0818 1.0555 1.0524 1.0739 1.0596 1.0679 1.5118 1.0775 1.1372 1.0551 1.0551 1.0615 1.0851 5.5850 5.9327 1.0540 1.0551 1.0592 1.0367 1.0357 1.0582 1.0448 1.0755 1.0993 1.0606 1.0780 1.0795 1.0988 1.1008 1.0992 1.1008 1.0994 1.0962 1.0994 1.0966 1.0965 1.0979 1.0841 1.0875 1.0915 1.0943 1.1006
irintensity: 0.6036 0.0722 0.0528 0.2037 0.0012 0.0936 0.0190 0.1072 1.0788 0.4192 0.0446 0.0799 0.2008 0.0480 0.7854 0.9572 0.2716 0.9250 0.5999 0.7478 7.2287 12.5346 12.4783 0.1483 1.0177 0.1171 0.4569 10.2954 1.9819 15.3671 0.0651 2.3775 54.5543 9.5552 31.8533 0.8718 5.9906 2.8278 0.3254 5.1126 6.2427 1.7335 6.2711 14.5601 30.1497 11.8771 0.1682 2.0636 0.2839 20.0657 8.3368 4.2500 2.4444 0.0104 4.7510 1.7390 11.1428 6.8170 4.5665 0.9905 3.1573 0.0640 17.3855 9.0911 0.6787 2.6490 6.1830 1.2152 2.3970 4.0818 1.7388 0.6071 1.3065 1.7798 8.2887 4.0225 23.1654 2.6497 14.7042 25.4580 0.8944 9.4603 5.1172 5.5498 2.8105 5.8390 4.9024 14.6014 5.5435 12.0388 12.5055 3.2845 5.1968 19.3012 27.4115 6.4931 5.2246 1.3062 8.3118 48.9720 101.4433 26.9089 32.2671 36.6001 17.3205 58.8896 22.8426 10.5148 26.6899 28.9204 67.1243 17.4927 28.3872 15.5582 110.7415 62.8225 33.3403 21.4588 43.0094 29.5535 40.8453 2.5969 2.5361 25.9849 49.7681 16.7465
temp: 298.150 k
press: 1.00000 atm
elementType: 7 6 6 6 6 6 6 6 6 6 6 6 6 6 6 6 6 1 1 1 1 1 1 1 1 1 1 1 1 1 1 1 1 1 1 1 1 1 1 1 1 1 1 1
symmnumber: 1
zpe: 1030873.7 jmol-1
zpe.correction: 0.392639 hartree
zpe.thermalcorrener: 0.412341 hartree
zpe.thermalcorrenthalpy: 0.413286 hartree
zpe.thermalcorrgfe: 0.344676 hartree
zpe.sumelectzpe: -679.269958 hartree
zpe.sumelectthermal: -679.250255 hartree
zpe.sumelectthermalent: -679.249311 hartree
zpe.sumelectthermalfe: -679.317920 hartree
dipole: 0.4305 0.0882 0.2704
dipole: 0.5160
quadrupole: -104.4002 -106.0687 -105.9365
quadrupole: -0.8716 -2.6650 2.7266
quadrupole: 1.0683 -0.6002 -0.4681 -0.8716 -2.6650 2.7266
hfenergy: -679.6625967 hartree
pointgroup: C01 [X(C16H27N1)]
dipole: -0.1728463 0.0028575 -0.1064203 debye
polarizability: 186.4061478|-12.5558823|189.9148609|-10.2747273|-6.9583345|156.7580369 unknown
InChI: InChI=1S/C16H27N/c1-6-7-13-16(14(2)3,17(4)5)15-11-9-8-10-12-15/h8-12,14H,6-7,13H2,1-5H3
charge 0 multiplicity 1
44 atoms
N  -0.509472 -1.855608 -1.05304
C  0.108247 -0.84837 -0.062839
C  0.326374 -1.613541 1.307562
C  1.474967 -0.415165 -0.68666
C  -0.873387 0.349645 0.097201
C  2.355677 0.59298 0.092671
C  0.738013 -0.733648 2.517358
C  1.293494 -2.812397 1.157945
C  3.357709 1.314948 -0.839055
C  -0.670917 -1.379034 -2.44982
C  -1.750753 -2.544326 -0.624578
C  -0.779327 1.513263 -0.716092
C  -1.990853 0.2723 0.977291
C  4.311884 2.261343 -0.08002
C  -1.740827 2.546562 -0.65055
C  -2.956485 1.299385 1.047633
C  -2.838637 2.448035 0.232688
H  -0.656728 -2.038665 1.586111
H  2.046034 -1.340094 -0.885403
H  1.290679 0.031649 -1.679973
H  2.928606 0.077803 0.886954
H  1.722914 1.347512 0.598559
H  0.125544 0.180706 2.596439
H  0.60058 -1.314614 3.449316
H  1.796852 -0.432762 2.475576
H  1.031346 -3.41989 0.274345
H  2.340686 -2.474674 1.045531
H  1.25075 -3.454008 2.058261
H  3.948292 0.560014 -1.398163
H  2.793625 1.892082 -1.601642
H  -1.36355 -0.51019 -2.553701
H  -1.081894 -2.210139 -3.050678
H  0.29764 -1.108962 -2.897668
H  -1.5992 -3.102752 0.312947
H  -2.015238 -3.285822 -1.400127
H  -2.627397 -1.866088 -0.494237
H  0.060645 1.632497 -1.40795
H  -2.107039 -0.594229 1.636232
H  4.916346 1.703898 0.660475
H  5.009404 2.773224 -0.768378
H  3.745603 3.037839 0.468176
H  -1.628122 3.430402 -1.289357
H  -3.79843 1.202904 1.743041
H  -3.584156 3.249185 0.286917
