program: Gaussian 09
title: 000263145
version: EM64L-G09RevD.01
frameworkgroup: C1[X(C15H16O2)]
method: RPBEPBE
basis: SDD
operation: Freq
keyword: #pfreq=noraman
keyword: PBEPBE/SDD
title: #p freq=noraman PBEPBE/SDD
converged: YES YES NO NO
title: Mulliken charges:
elementType: O O C C C C C C C C C C C C C C C H H H H H H H H H H H H H H H H
charge: -0.496940 -0.479211 -0.630362 -0.195683 0.389820 0.431043 0.244762 -0.407722 -0.370346 -0.499075 -0.417882 -0.397477 -0.231747 -0.247241 -0.230545 -0.221935 -0.245560 0.243331 0.231925 0.201117 0.237354 0.231629 0.237899 0.222945 0.222671 0.288555 0.231027 0.232799 0.398723 0.220478 0.221782 0.223891 0.359977
chargesum: 0.00000
title: Mulliken charges with hydrogens summed into heavy atoms:
elementType: O O C C C C C C C C C C C C C C C
charge: -0.098218 -0.119235 -0.155106 0.005434 0.389820 0.431043 0.244762 -0.170368 -0.138718 -0.038231 -0.195212 -0.108922 -0.000720 -0.014443 -0.010067 -0.000153 -0.021669
polarizability: 2.30955249e+02 -2.99702908e+00 1.75438378e+02 -1.49531346e+01 1.23181581e+01 8.88594437e+01
1716.lowfreq: -7.2059 -0.0008 -0.0005 0.0003 3.5820 7.8214 29.7648 33.9277 44.8831
frequency: 29.4168 33.8361 44.7706 78.6839 114.8602 118.8203 185.5158 212.4967 218.8363 282.2825 325.9237 338.7307 362.8052 404.2254 410.2959 413.2576 449.7722 488.8118 492.5577 548.7842 567.5597 598.0468 616.8099 635.7617 706.1725 730.2273 743.8198 767.3442 771.0274 815.2432 838.2321 854.4896 858.1439 861.9761 889.7782 911.7020 925.2432 952.2979 956.5281 978.9561 984.2752 989.5267 992.7018 1000.8908 1015.4276 1027.2699 1048.5632 1078.1608 1099.8775 1144.9660 1168.3096 1173.1680 1177.8105 1179.9193 1197.9289 1206.3470 1228.0784 1234.1277 1272.9720 1286.5518 1291.0856 1305.0551 1322.2698 1356.9466 1381.5791 1386.4059 1424.4515 1435.9278 1436.5561 1460.4367 1479.9272 1483.4135 1485.7004 1584.4301 1594.3846 1609.9845 1614.5707 2916.1284 3001.7170 3012.3630 3061.6865 3098.4647 3101.6457 3109.5769 3118.5001 3121.5735 3135.3624 3139.9393 3154.9887 3162.2286 3175.5696 3181.8513 3571.6445
redmass: 4.1953 4.5736 4.7577 4.3974 4.3134 4.1953 5.2955 4.6421 4.9833 4.1109 2.3856 2.5957 2.7208 2.8580 2.5926 1.7733 3.2699 3.9527 3.3009 3.0579 4.8874 4.7770 6.4007 5.3738 1.9726 2.1577 3.8896 1.5671 2.1502 2.2225 1.8733 1.7050 1.4750 1.8258 2.0075 3.7037 1.5402 1.5029 1.5445 1.3640 2.7082 5.8309 1.3872 1.4203 3.7334 2.1174 2.2121 1.5831 1.8031 1.1931 1.0819 1.1706 1.1504 1.1421 2.4993 2.1718 2.1801 1.2237 1.2312 1.2099 1.2774 1.2884 1.2583 1.2087 6.2131 7.7939 1.3834 2.2035 2.2031 1.1273 1.5147 2.3181 1.5938 6.5475 6.3065 6.2803 6.1489 1.0836 1.0602 1.0647 1.1018 1.1004 1.0875 1.0883 1.0885 1.0863 1.0929 1.0923 1.0988 1.1004 1.0947 1.0712 1.0663
irintensity: 0.8827 1.3766 2.9819 0.3974 3.2017 1.0281 11.0106 2.7648 1.1655 7.1154 2.2694 21.8259 33.1976 1.5841 12.3940 84.9574 1.0193 10.5186 4.9410 43.1119 11.9633 6.6339 0.2681 3.0648 48.7717 1.3215 14.0225 101.5019 9.7391 14.1320 63.7210 0.5953 0.3632 21.9976 5.8400 98.5540 17.2681 3.4487 21.8111 0.8050 19.3715 0.3052 2.5313 1.4307 50.6362 12.5373 16.3567 4.5915 17.1450 32.1629 2.1418 3.6249 4.6714 0.8047 3.4678 14.9726 20.7478 5.6081 45.8815 4.6137 13.3121 5.7602 11.9620 29.5372 1.3537 2.5679 53.4836 8.2173 12.5249 11.8203 15.1573 19.4580 15.0060 2.2495 0.6680 9.5036 10.1347 38.7700 21.0638 69.0309 15.3830 9.2731 18.1499 14.8474 4.3562 0.8672 37.5586 20.9814 45.8976 30.4668 37.5644 545.6261 10.9835
temp: 298.150 k
press: 1.00000 atm
elementType: 8 8 6 6 6 6 6 6 6 6 6 6 6 6 6 6 6 1 1 1 1 1 1 1 1 1 1 1 1 1 1 1 1
symmnumber: 1
zpe: 710326.3 jmol-1
zpe.correction: 0.270549 hartree
zpe.thermalcorrener: 0.285513 hartree
zpe.thermalcorrenthalpy: 0.286457 hartree
zpe.thermalcorrgfe: 0.227018 hartree
zpe.sumelectzpe: -730.402372 hartree
zpe.sumelectthermal: -730.387408 hartree
zpe.sumelectthermalent: -730.386463 hartree
zpe.sumelectthermalfe: -730.445903 hartree
dipole: 4.0770 -1.8038 0.1742
dipole: 4.4616
quadrupole: -85.5296 -97.3841 -103.2204
quadrupole: 5.7191 -5.8238 3.7364
quadrupole: 9.8485 -2.0061 -7.8424 5.7191 -5.8238 3.7364
hfenergy: -730.6729207 hartree
pointgroup: C01 [X(C15H16O2)]
dipole: 1.5741628 -0.7617663 0.1512653 debye
polarizability: 230.8205612|-6.5111771|177.3981759|-12.9397881|4.5109128|87.0343343 unknown
InChI: InChI=1S/C15H16O2/c16-11-14-9-5-4-8-13(14)10-15(17)12-6-2-1-3-7-12/h1-9,15-17H,10-11H2
charge 0 multiplicity 1
33 atoms
O  -0.482822 1.876083 -0.786438
O  2.126602 2.492245 -0.854191
C  0.19119 -0.0025 0.743768
C  -0.644221 0.45856 -0.518868
C  1.610032 -0.472543 0.45254
C  -2.133597 0.192905 -0.295972
C  2.738527 0.400352 0.345787
C  1.830317 -1.865628 0.279946
C  4.027504 -0.140442 0.094896
C  2.604755 1.905026 0.438432
C  -2.632778 -1.132911 -0.353885
C  -3.026823 1.252524 -0.011656
C  3.111868 -2.393702 0.012743
C  4.224361 -1.526807 -0.076056
C  -4.000103 -1.399154 -0.120148
C  -4.395718 0.987711 0.224333
C  -4.887609 -0.337037 0.17477
H  -0.350233 -0.837133 1.222716
H  0.162812 0.84491 1.4543
H  -0.304121 -0.150486 -1.387815
H  0.97651 -2.548219 0.372182
H  4.887969 0.539514 0.03955
H  1.837652 2.228554 1.158898
H  3.568356 2.377641 0.704018
H  -1.953164 -1.961923 -0.594179
H  -2.632466 2.272278 -0.001518
H  3.243846 -3.474341 -0.111513
H  5.226722 -1.925051 -0.266525
H  0.486886 2.115816 -0.937349
H  -4.374103 -2.42821 -0.174007
H  -5.079609 1.81667 0.441375
H  -5.949518 -0.540158 0.355112
H  2.732975 2.206454 -1.58295
