program: Gaussian 09
title: 000263122
version: EM64L-G09RevD.01
frameworkgroup: C1[X(C21H16O2)]
method: RPBEPBE
basis: SDD
operation: Freq
keyword: #pfreq=noraman
keyword: PBEPBE/SDD
title: #p freq=noraman PBEPBE/SDD
converged: YES YES NO NO
title: Mulliken charges:
elementType: O O C C C C C C C C C C C C C C C C C C C C C H H H H H H H H H H H H H H H H
charge: -0.275258 -0.225527 0.085779 -0.697680 0.382545 0.375660 0.482811 0.059367 0.111429 -0.439450 -0.392082 -0.402792 -0.389508 -0.347736 -0.355046 -0.221319 -0.234565 -0.234764 -0.243857 -0.225070 -0.236292 -0.241503 -0.239030 0.268682 0.243264 0.241921 0.253474 0.237989 0.274403 0.269224 0.275480 0.232813 0.236560 0.226187 0.226723 0.227781 0.229893 0.229158 0.230335
chargesum: 0.00000
title: Mulliken charges with hydrogens summed into heavy atoms:
elementType: O O C C C C C C C C C C C C C C C C C C C C C
charge: -0.275258 -0.225527 0.085779 -0.185734 0.382545 0.375660 0.482811 0.059367 0.111429 -0.197528 -0.138608 -0.164803 -0.115105 -0.078511 -0.079566 0.011494 0.001996 -0.008578 -0.017134 0.002711 -0.006399 -0.012346 -0.008695
polarizability: 2.62989474e+02 -1.25882115e+01 1.97184751e+02 3.95932992e+00 -1.46523246e+01 1.99540638e+02
1716.lowfreq: -10.0664 0.0003 0.0006 0.0006 4.9158 10.0333 26.7409 35.9527 47.7570
frequency: 26.6225 35.9265 47.7312 53.9521 66.2133 83.9287 125.8772 181.4616 208.1152 235.8109 245.0240 262.7956 284.7864 303.5461 342.0464 350.1072 400.4121 403.0418 418.2548 450.4029 476.1781 481.1093 508.8289 526.3391 576.7823 596.4188 613.7645 616.2550 623.8840 656.0322 674.2353 702.2665 703.3787 707.0987 730.8165 755.9843 766.1286 780.1954 791.5786 823.9573 852.1097 858.9409 870.7229 892.2259 910.8346 931.7706 943.8504 971.6979 979.1356 983.9581 986.3837 990.3921 991.8420 998.7742 999.7798 1003.8864 1007.1741 1025.0861 1032.6840 1042.7099 1058.7736 1086.2186 1097.6822 1101.9624 1168.2510 1172.7310 1174.6732 1175.1079 1190.4743 1195.9378 1208.0133 1210.7007 1222.2949 1255.4523 1282.8009 1317.8011 1318.9096 1329.6643 1379.5327 1380.2680 1389.5266 1434.2380 1435.6863 1444.2575 1460.2971 1478.6451 1480.0620 1484.2774 1587.4663 1590.7759 1591.4016 1610.1056 1611.6870 1613.4825 1641.7534 2993.2424 3059.0952 3122.9260 3124.3757 3125.0910 3133.3680 3134.3806 3140.1468 3145.5800 3146.6070 3154.3114 3155.8021 3159.6927 3167.8227 3170.1264 3172.4554
redmass: 3.8622 4.2230 4.6382 6.2574 5.6910 4.8931 4.7978 5.5148 5.0701 4.5790 5.3232 4.8716 5.9944 4.7470 6.8926 2.8330 2.8061 2.8640 3.5526 6.0737 3.8528 3.5196 4.5880 5.9389 4.9922 4.1132 6.0006 6.4030 5.9682 5.5306 4.8527 4.9717 1.6788 1.7790 3.0757 2.2896 1.9456 2.1797 2.0689 3.8167 1.2750 1.2903 4.5042 1.4172 1.8886 1.4551 2.5542 1.5101 1.3849 1.4014 3.6789 5.3782 4.5507 1.3507 1.3339 1.3514 3.9978 2.7276 2.0749 2.2873 2.8102 1.5883 1.8187 1.9859 1.4860 1.0518 1.0589 1.0783 1.1258 1.1245 2.8009 2.2881 2.8143 2.4243 1.5751 1.3427 1.4478 1.5531 8.3005 8.5308 7.7448 2.2237 2.2121 2.4092 1.1837 2.3744 2.1973 2.1292 7.1466 6.1680 6.1206 6.0653 6.7824 6.0307 11.6834 1.0648 1.0958 1.0876 1.0847 1.0847 1.0883 1.0879 1.0896 1.0936 1.0926 1.0938 1.0958 1.0975 1.1010 1.0999 1.0976
irintensity: 0.0340 0.4789 0.2501 1.3772 0.3166 1.1529 1.0872 0.0876 0.4451 0.5893 1.1047 0.3454 6.2726 2.0441 2.2849 2.7855 0.0276 0.3031 0.1535 0.7639 3.5038 3.0107 2.6042 4.9175 1.6027 22.9756 6.0775 0.0095 11.3628 11.0419 25.2840 14.7227 60.9003 53.2594 21.1420 28.6784 42.7892 33.9355 20.6469 2.3783 1.1505 2.0120 26.6157 2.3506 9.5734 3.0323 4.3750 6.6257 0.4310 3.3205 109.2730 9.3202 20.2929 2.0346 2.5979 1.8946 126.0185 17.0329 4.7111 40.9727 5.1472 4.3513 8.7557 53.8473 4.6226 0.5879 1.7038 1.4144 12.3272 5.7884 6.5536 5.1859 151.8831 47.1166 12.6869 3.3763 2.5028 6.6398 2.0103 0.1294 2.4532 10.0299 14.5693 18.6782 20.1994 14.0867 18.3061 7.8170 2.9795 1.1251 0.1922 5.1034 62.7792 2.0840 244.7294 11.8498 11.3162 4.5072 0.7973 0.9722 3.7147 6.0611 10.2664 28.7152 25.4294 10.9093 20.7306 30.2128 15.9842 23.7337 9.9324
temp: 298.150 k
press: 1.00000 atm
elementType: 8 8 6 6 6 6 6 6 6 6 6 6 6 6 6 6 6 6 6 6 6 6 6 1 1 1 1 1 1 1 1 1 1 1 1 1 1 1 1
symmnumber: 1
zpe: 802677.4 jmol-1
zpe.correction: 0.305724 hartree
zpe.thermalcorrener: 0.323660 hartree
zpe.thermalcorrenthalpy: 0.324604 hartree
zpe.thermalcorrgfe: 0.258507 hartree
zpe.sumelectzpe: -958.723352 hartree
zpe.sumelectthermal: -958.705416 hartree
zpe.sumelectthermalent: -958.704472 hartree
zpe.sumelectthermalfe: -958.770569 hartree
dipole: -0.2405 1.5554 -4.8418
dipole: 5.0912
quadrupole: -117.5241 -126.5508 -135.3215
quadrupole: -3.1172 6.5624 4.2641
quadrupole: 8.9413 -0.0853 -8.8560 -3.1172 6.5624 4.2641
hfenergy: -959.0290758 hartree
pointgroup: C01 [X(C21H16O2)]
dipole: 0.0479058 -0.5123845 -1.9358089 debye
polarizability: 262.2269839|-13.5848633|196.2297973|-5.4106251|14.7957587|201.2580825 unknown
InChI: InChI=1S/C21H16O2/c22-20-19-14-8-7-9-16(19)15-21(23-20,17-10-3-1-4-11-17)18-12-5-2-6-13-18/h1-14H,15H2
charge 0 multiplicity 1
39 atoms
O  -0.071744 0.843852 1.345844
O  1.669341 1.178999 2.781815
C  -0.54066 0.290851 0.010934
C  0.243832 1.042446 -1.094757
C  -2.031578 0.658471 -0.068663
C  -0.31892 -1.231022 0.036307
C  1.74158 0.920878 -0.89213
C  2.240023 0.878974 0.438472
C  1.309574 0.964587 1.604001
C  2.656551 0.884783 -1.967652
C  -2.906852 -0.098472 -0.88671
C  0.138135 -1.956708 -1.090223
C  -2.530821 1.800837 0.60517
C  -0.638972 -1.94009 1.223227
C  3.632997 0.802536 0.683789
C  4.046258 0.804068 -1.723721
C  4.537131 0.761646 -0.395982
C  -4.258161 0.285019 -1.035756
C  0.277653 -3.362678 -1.032468
C  -3.884689 2.177542 0.462031
C  -0.496877 -3.34163 1.283325
C  -4.752645 1.425525 -0.362548
C  -0.039581 -4.060595 0.153417
H  -0.059186 2.106722 -1.042012
H  -0.060991 0.682978 -2.093013
H  2.282567 0.918765 -2.997952
H  -2.538793 -0.99711 -1.394167
H  0.400055 -1.437588 -2.018018
H  -1.863595 2.368893 1.259663
H  -0.98535 -1.381696 2.099129
H  3.979695 0.783141 1.72208
H  4.746329 0.772906 -2.56609
H  5.614476 0.699616 -0.210178
H  -4.924743 -0.310894 -1.66932
H  0.637755 -3.908719 -1.911641
H  -4.26198 3.056061 0.997483
H  -0.742453 -3.873169 2.209317
H  -5.802539 1.719332 -0.472705
H  0.070879 -5.149757 0.199099
