program: Gaussian 09
title: 000263108
version: EM64L-G09RevD.01
frameworkgroup: C1[X(C13H21N)]
method: RPBEPBE
basis: SDD
operation: Freq
keyword: #pfreq=noraman
keyword: PBEPBE/SDD
title: #p freq=noraman PBEPBE/SDD
converged: YES YES NO NO
title: Mulliken charges:
elementType: N C C C C C C C C C C C C C H H H H H H H H H H H H H H H H H H H H H
charge: -0.080350 0.258818 0.116729 0.142893 -0.571012 0.371967 0.376427 -0.715888 -0.883582 -0.875706 -0.857380 -0.851322 -0.617547 -0.629357 0.225414 0.221506 0.229840 0.236503 0.244177 0.249180 0.233438 0.287368 0.226378 0.232652 0.228105 0.226421 0.228781 0.229178 0.229480 0.224211 0.187248 0.223836 0.220411 0.176337 0.254846
chargesum: 0.00000
title: Mulliken charges with hydrogens summed into heavy atoms:
elementType: N C C C C C C C C C C C C C
charge: -0.080350 0.258818 0.116729 0.142893 -0.124093 0.371967 0.376427 -0.486048 -0.153722 -0.128523 -0.170201 -0.163883 0.017748 0.022237
polarizability: 1.76884497e+02 1.62901694e+00 1.69106875e+02 -9.13490181e+00 1.33474485e+00 1.01760441e+02
1716.lowfreq: -6.6419 -5.5089 -0.0001 0.0006 0.0006 8.7972 55.0956 62.1974 80.3071
frequency: 55.0663 62.1928 80.2830 107.1945 116.2250 131.3325 147.7672 180.8018 195.4955 209.2578 233.9231 255.9010 278.1432 295.9195 313.7958 322.2288 338.4124 354.5412 358.8488 397.4762 429.9635 439.7463 495.0186 546.8055 548.4033 589.5256 651.8083 686.3241 755.4815 794.9144 821.5252 881.1133 903.8830 968.4980 996.5072 1009.9043 1019.8639 1023.8312 1030.3902 1035.7126 1051.8683 1054.6956 1056.5465 1079.7077 1085.4322 1093.2377 1135.4816 1171.8479 1223.0055 1245.9243 1253.5595 1266.5463 1311.7152 1356.3270 1364.9675 1387.4859 1393.1502 1399.6424 1401.7620 1405.7267 1415.9475 1438.6764 1453.9058 1455.6856 1459.4636 1465.4375 1467.6477 1473.2418 1473.8796 1478.3901 1484.2691 1486.8336 1488.1173 1492.0220 1501.3800 1510.8001 1585.0878 1613.0426 2838.9269 2851.9488 2896.6458 2958.1363 2968.3736 2969.1141 2975.9347 2996.7342 3012.5929 3023.2704 3042.6649 3043.5653 3046.9333 3049.3937 3072.3099 3076.6203 3077.0076 3086.8800 3091.2539 3098.9581 3107.5731
redmass: 2.5091 2.5919 2.9312 1.5539 1.3829 1.3223 2.0184 1.2144 1.4378 1.6245 1.1821 1.1631 2.3016 2.4810 2.8650 2.8577 2.3360 3.2649 2.4655 2.1148 2.3419 4.4159 4.4772 2.5630 3.4936 3.2623 3.8444 4.2825 3.4391 3.1976 3.7915 1.3265 2.3469 1.5663 1.3413 2.1614 1.5573 1.4203 1.5183 1.4791 1.6531 2.3831 1.6940 2.1031 1.9135 1.4395 1.4344 2.0088 5.0229 1.4618 2.3099 1.5817 6.0146 2.0466 2.4487 1.2662 1.2865 1.2378 1.3833 2.5066 1.1457 1.1796 1.2140 1.4816 1.0501 1.0959 1.0598 1.0921 1.0583 1.0815 1.0616 1.1856 1.2460 1.1457 1.0786 1.0657 5.9332 6.6368 1.0575 1.0575 1.0685 1.0434 1.0378 1.0378 1.0412 1.0881 1.0716 1.0719 1.0973 1.0961 1.0910 1.0952 1.1010 1.0978 1.0985 1.1000 1.0980 1.0951 1.0910
irintensity: 0.6290 0.1447 0.4293 0.1264 0.0126 0.9519 4.5410 0.0800 0.9190 0.9127 0.5934 0.3363 1.0799 3.4671 4.7457 1.4683 3.2362 0.0188 3.3567 3.2571 0.2323 0.1296 1.7329 0.4415 2.5385 0.0380 1.1865 3.6917 2.1823 3.8989 15.1383 8.7625 2.9163 2.2928 1.3452 59.1870 15.9182 3.5842 26.6225 12.8434 2.7172 2.6008 1.8995 2.1074 1.2821 8.2969 3.6513 6.4395 3.8191 1.8049 4.3455 10.7157 0.5878 6.4456 4.7772 10.3417 7.9566 23.7251 6.7056 1.8010 3.0878 4.5136 1.7275 5.4345 19.9267 6.2669 16.9925 14.3397 9.9616 8.8342 22.5171 18.1786 16.7843 15.2555 15.6371 4.5015 0.0286 2.5254 69.7244 181.5881 106.0187 39.8829 58.7821 24.5287 36.3655 28.4324 43.6603 40.5591 18.9821 36.6974 12.2584 15.0592 33.0573 13.9820 32.5217 30.5864 9.4166 18.6714 33.4251
temp: 298.150 k
press: 1.00000 atm
elementType: 7 6 6 6 6 6 6 6 6 6 6 6 6 6 1 1 1 1 1 1 1 1 1 1 1 1 1 1 1 1 1 1 1 1 1
symmnumber: 1
zpe: 806470.4 jmol-1
zpe.correction: 0.307168 hartree
zpe.thermalcorrener: 0.323524 hartree
zpe.thermalcorrenthalpy: 0.324468 hartree
zpe.thermalcorrgfe: 0.264612 hartree
zpe.sumelectzpe: -561.632122 hartree
zpe.sumelectthermal: -561.615767 hartree
zpe.sumelectthermalent: -561.614822 hartree
zpe.sumelectthermalfe: -561.674679 hartree
dipole: 0.6149 -0.7404 -0.2464
dipole: 0.9935
quadrupole: -81.0498 -82.9436 -88.2788
quadrupole: -0.8814 -1.7868 -0.5373
quadrupole: 3.0410 1.1471 -4.1881 -0.8814 -1.7868 -0.5373
hfenergy: -561.9392904 hartree
pointgroup: C01 [X(C13H21N1)]
dipole: -0.1969675 -0.3345225 0.0454968 debye
polarizability: 176.7254893|1.2476962|167.754388|-10.5605995|8.7039969|103.2719358 unknown
InChI: InChI=1S/C13H21N/c1-9-7-10(2)12(4)13(11(9)3)8-14(5)6/h7H,8H2,1-6H3
charge 0 multiplicity 1
35 atoms
N  -2.682228 -0.195158 -0.31981
C  -0.244486 -0.163995 0.358851
C  0.731238 -1.158267 0.039315
C  0.101476 1.22178 0.393422
C  -1.674501 -0.567877 0.717737
C  2.06837 -0.754888 -0.252269
C  1.438302 1.617488 0.10283
C  2.390463 0.621432 -0.213235
C  0.363919 -2.639093 0.01623
C  -0.948313 2.260369 0.762069
C  3.162455 -1.755325 -0.598971
C  1.867088 3.076366 0.134562
C  -4.059648 -0.398393 0.16958
C  -2.453764 -0.845906 -1.623902
H  -1.727701 -1.659077 0.945732
H  -1.975046 -0.04298 1.646049
H  3.421232 0.927521 -0.434338
H  0.134119 -3.020307 1.030199
H  -0.52491 -2.833626 -0.610563
H  1.187063 -3.252627 -0.381598
H  -0.679169 3.263788 0.393412
H  -1.926096 1.981331 0.333408
H  -1.06424 2.339698 1.862801
H  4.122464 -1.237164 -0.765316
H  3.320343 -2.496315 0.207783
H  2.929857 -2.324164 -1.519977
H  1.339141 3.677897 -0.630739
H  1.6560 3.546806 1.113345
H  2.949797 3.171515 -0.057304
H  -4.221523 0.192844 1.089595
H  -4.295032 -1.469112 0.402988
H  -4.780749 -0.051687 -0.592425
H  -3.153871 -0.429884 -2.370999
H  -2.602876 -1.956708 -1.59479
H  -1.424776 -0.642783 -1.96497
