program: Gaussian 09
title: 000263123
version: EM64L-G09RevD.01
frameworkgroup: C1[X(C21H18O)]
method: RPBEPBE
basis: SDD
operation: Freq
keyword: #pfreq=noraman
keyword: PBEPBE/SDD
title: #p freq=noraman PBEPBE/SDD
converged: YES YES NO NO
title: Mulliken charges:
elementType: O C C C C C C C C C C C C C C C C C C C C C H H H H H H H H H H H H H H H H H H
charge: -0.306602 0.110519 0.203329 -0.654723 0.219801 0.424401 -0.421390 0.525974 -0.415398 -0.388120 -0.402531 -0.383333 -0.243812 -0.228443 -0.417663 -0.384559 -0.238976 -0.235290 -0.240514 -0.233750 -0.232796 -0.246569 0.225102 0.241232 0.224452 0.220275 0.248066 0.238376 0.254536 0.264494 0.227527 0.226913 0.215541 0.260966 0.223403 0.224452 0.227609 0.221607 0.221416 0.224476
chargesum: 0.00000
title: Mulliken charges with hydrogens summed into heavy atoms:
elementType: O C C C C C C C C C C C C C C C C C C C C C
charge: -0.306602 0.110519 0.203329 -0.188390 0.219801 0.424401 0.023337 0.525974 -0.167331 -0.149743 -0.147995 -0.118839 -0.016285 -0.001530 -0.202122 -0.123593 -0.015573 -0.010838 -0.012906 -0.012143 -0.011380 -0.022093
polarizability: 2.52982333e+02 2.44242500e+01 1.88144183e+02 6.06923529e+00 -2.04963320e+01 1.98539779e+02
1716.lowfreq: -6.9551 -0.0003 0.0003 0.0005 5.9691 12.0672 25.3207 33.9503 38.2576
frequency: 25.2353 33.6574 38.2117 54.9264 69.6432 84.8533 123.3856 164.5981 191.3496 230.7296 233.7831 249.8477 283.5676 320.9178 345.2581 403.3461 405.5537 423.6120 448.5349 453.6806 484.7521 506.4028 548.9645 568.7552 586.8780 616.2807 617.8783 646.0411 660.8263 700.8185 704.7877 706.5936 725.3366 754.4576 759.3668 771.9765 807.6109 810.3684 829.8645 851.7131 857.2133 874.2657 904.1982 925.8995 930.9221 950.7770 959.6936 972.5709 974.7888 981.2618 987.6212 990.2686 990.8826 992.8347 996.6118 1012.0208 1025.1598 1028.1381 1029.3484 1045.7089 1081.6230 1087.3051 1111.9212 1148.1382 1162.1390 1170.6416 1171.5343 1172.9198 1187.6610 1190.9428 1194.2062 1211.2460 1217.5850 1249.4587 1276.9100 1309.8108 1313.2808 1322.9872 1332.0929 1379.0689 1382.3747 1395.4360 1433.5216 1439.4183 1446.5091 1457.0990 1467.5774 1474.0363 1478.2913 1483.3287 1590.1857 1591.6184 1599.6452 1608.5028 1614.2114 1621.4728 2951.5195 2993.3421 3043.6850 3048.6153 3109.5247 3121.6105 3121.9804 3122.5104 3128.9048 3131.3733 3135.9561 3142.8714 3146.1630 3152.5230 3153.9581 3162.3493 3164.5644 3164.9004
redmass: 3.9848 4.0161 4.8104 4.7209 3.9967 3.9600 5.1837 4.0936 2.8748 5.1354 4.3935 5.1264 4.2835 3.3804 2.7791 2.8450 2.8214 2.9028 3.3524 4.0335 4.0071 4.2504 5.3866 4.9932 4.4380 6.3794 6.2692 5.0076 5.3433 5.1675 1.7445 1.7508 3.1031 2.0066 1.3979 2.0041 2.9027 3.6135 4.4196 1.2483 1.2483 1.2979 2.0088 1.4440 2.0008 1.7137 7.4733 1.6903 1.8294 1.4347 1.4101 4.7424 3.7395 1.4742 1.3484 1.8906 2.3939 2.2088 2.1470 3.8806 1.5912 1.5864 1.9615 1.1144 2.1361 1.0617 1.0567 1.0699 1.1288 1.1866 2.3614 1.8536 2.0440 1.7517 1.6346 1.5334 1.3895 1.4888 1.2968 8.5912 7.7052 5.9083 2.2121 2.0890 2.3642 1.1647 1.8277 1.3982 2.1178 2.3253 6.1728 6.0753 7.0583 6.0531 6.1835 7.0742 1.0663 1.0599 1.0966 1.1009 1.0871 1.0855 1.0852 1.0859 1.0892 1.0881 1.0927 1.0943 1.0921 1.0962 1.0951 1.1003 1.0996 1.1008
irintensity: 0.0302 0.0609 0.5502 0.6450 0.2406 0.3285 0.8070 0.2913 5.3731 0.5938 2.2444 0.8142 2.3528 6.0734 5.6467 0.2240 0.0425 4.8460 1.3129 4.5881 1.3462 5.1842 0.3259 6.3497 25.2991 0.5266 0.3789 17.5995 9.8205 5.9501 33.4705 81.3138 19.1624 12.8078 65.9674 52.1303 4.8260 4.6896 1.2740 1.1159 0.2940 1.7099 6.0917 1.9684 4.3100 4.2129 71.0694 5.5951 3.3335 0.1697 0.0355 0.4215 0.2096 0.3887 0.7544 4.0244 4.0486 13.4180 2.6720 9.5545 18.0105 0.7441 1.3388 1.9597 4.2984 0.4097 0.0188 0.3908 1.4711 9.7817 6.5070 2.0807 1.8716 6.4225 1.9987 1.5856 1.9541 4.7986 3.5299 0.3473 0.0570 3.9256 12.1591 4.2663 7.8355 13.9819 9.2365 0.7443 21.2625 21.7374 0.6081 1.5648 0.1091 7.2299 7.4544 0.6857 65.2038 26.7137 25.6827 7.2628 11.5604 2.5576 1.3881 2.7097 4.0716 11.1011 30.2407 30.9295 19.4557 30.6007 24.6718 31.4068 22.8769 13.7084
temp: 298.150 k
press: 1.00000 atm
elementType: 8 6 6 6 6 6 6 6 6 6 6 6 6 6 6 6 6 6 6 6 6 6 1 1 1 1 1 1 1 1 1 1 1 1 1 1 1 1 1 1
symmnumber: 1
zpe: 849621.4 jmol-1
zpe.correction: 0.323604 hartree
zpe.thermalcorrener: 0.341258 hartree
zpe.thermalcorrenthalpy: 0.342202 hartree
zpe.thermalcorrgfe: 0.276361 hartree
zpe.sumelectzpe: -884.729609 hartree
zpe.sumelectthermal: -884.711955 hartree
zpe.sumelectthermalent: -884.711011 hartree
zpe.sumelectthermalfe: -884.776851 hartree
dipole: -0.3302 1.6421 -0.3590
dipole: 1.7130
quadrupole: -122.1191 -124.6046 -117.0963
quadrupole: 4.6944 1.4698 -1.8605
quadrupole: -0.8458 -3.3313 4.1770 4.6944 1.4698 -1.8605
hfenergy: -885.0532128 hartree
pointgroup: C01 [X(C21H18O1)]
dipole: 0.1116917 -0.6447337 -0.1614301 debye
polarizability: 255.2049628|20.736026|184.5919743|-1.4148645|21.304897|199.8693578 unknown
InChI: InChI=1S/C21H18O/c1-3-9-17(10-4-1)15-21(19-12-5-2-6-13-19)20-14-8-7-11-18(20)16-22-21/h1-14H,15-16H2
charge 0 multiplicity 1
40 atoms
O  0.201798 0.424488 1.726148
C  0.520058 0.310305 0.260029
C  -0.010784 -1.076051 -0.094405
C  -0.196973 1.499507 -0.455096
C  -0.254301 -1.811561 1.088335
C  2.048843 0.459334 0.077866
C  0.062377 -0.940638 2.287693
C  -1.717388 1.484328 -0.417796
C  -0.259558 -1.650922 -1.355417
C  -0.731647 -3.133931 1.033017
C  2.782671 -0.27947 -0.882016
C  2.734087 1.41042 0.878077
C  -0.746694 -2.978824 -1.419847
C  -0.975752 -3.717633 -0.23458
C  -2.463954 1.272025 -1.605047
C  -2.424053 1.709717 0.793367
C  4.171423 -0.067051 -1.044993
C  4.120215 1.621558 0.717863
C  4.84538 0.885715 -0.248999
C  -3.877359 1.27602 -1.588538
C  -3.836298 1.712384 0.814173
C  -4.569792 1.494914 -0.376009
H  0.157137 1.512997 -1.503498
H  0.191775 2.421118 0.019049
H  -0.745229 -0.905922 3.040337
H  1.008239 -1.244509 2.784542
H  -0.098984 -1.079581 -2.276889
H  -0.922233 -3.703709 1.949673
H  2.281025 -1.037128 -1.492608
H  2.173842 1.95705 1.643904
H  -0.954697 -3.435094 -2.393943
H  -1.355617 -4.743437 -0.298209
H  -1.934327 1.107822 -2.552376
H  -1.855087 1.872178 1.714277
H  4.726045 -0.650614 -1.788812
H  4.63573 2.355797 1.347577
H  5.921917 1.04815 -0.374037
H  -4.435069 1.111133 -2.517662
H  -4.365966 1.888954 1.757682
H  -5.665694 1.500558 -0.359134
